Opened 11 years ago

Closed 11 years ago

Last modified 8 years ago

#8770 closed defect (worksforme)

Spinner: robot test failures on Spinner_mouse.html for IE8

Reported by: bill Owned by: haysmark
Priority: high Milestone: 1.3
Component: Dijit - Form Version: 1.3.0b1
Keywords: Cc:
Blocked By: Blocking:

Description


Change History (5)

comment:1 Changed 11 years ago by Douglas Hays

Resolution: duplicate
Status: newclosed

dup of #8796

comment:2 Changed 11 years ago by bill

Resolution: duplicate
Status: closedreopened
Summary: Spinner: robot test failures on IE8Spinner: robot test failures on Spinner_mouse.html for IE8

Unfortunatley I'm (also) getting failures on Spinner_mouse.html.

FAILED test: spinner1_max 0 ms
_AssertFailure: doh._AssertFailure: assertEqual() failed: expected 0 but got 1 : assertEqual() failed: expected 0 but got 1 
[ Error: assertEqual() failed: expected 0 but got 1 ]
ERROR IN: function()
FAILED test: spinner1_min 0 ms
PASSED test: spinner1_invalid 0 ms
[ Error: spinner 1: wrong value, expected 910, got 1550 ]
ERROR IN: function()
Total time for GROUP " arrowButton " is 0 ms
FAILED test: spinner1 0 ms

One of the tests in Spinner_mouse.html is labeled as "a11y" but that's just a cut/paste error; it's actually a mouse test.

comment:3 Changed 11 years ago by Douglas Hays

Owner: set to haysmark
Status: reopenednew

comment:4 Changed 11 years ago by bill

Resolution: worksforme
Status: newclosed

This isn't failing for me anymore... probably fixed in the IE8 production release.

comment:5 Changed 8 years ago by bill

Component: DijitDijit - Form
Note: See TracTickets for help on using tickets.