Opened 7 years ago

Closed 4 years ago

#16951 closed defect (patchwelcome)

dojox.gesture issues in IE

Reported by: haysmark Owned by: Evan
Priority: undecided Milestone: 1.13
Component: Dojox Version: 1.8.3
Keywords: Cc:
Blocked By: Blocking:

Description

In IE9, it seems dojox.gestures are not propagating. The bubble tests all fail:

    _AssertFailure: assertEqual() failed: 	expected
		false
	but got
		true
FAILED test: ../../dojox/gesture/tests/doh/bubble.html::dojox.gesture.* bubbling::tapBubble 20 ms

_AssertFailure: assertEqual() failed: 	expected
		false
	but got
		true
FAILED test: ../../dojox/gesture/tests/doh/bubble.html::dojox.gesture.* bubbling::tapStopBubble 1 ms

_AssertFailure: assertEqual() failed: 	expected
		false
	but got
		true
FAILED test: ../../dojox/gesture/tests/doh/bubble.html::dojox.gesture.* bubbling::swipeStopBubble 0 ms

In IE10, it is even worse; every test except for the disconnect/destroy tests fail.

Change History (2)

comment:1 Changed 7 years ago by haysmark

Owner: changed from Adam Peller to Evan
Status: newassigned

comment:2 Changed 4 years ago by dylan

Milestone: tbd1.12
Resolution: patchwelcome
Status: assignedclosed

Given that no one has shown interest in creating a patch in the past 2+ years, I'm closing this as patchwelcome.

Note: See TracTickets for help on using tickets.