Opened 8 years ago

Closed 8 years ago

Last modified 8 years ago

#13129 closed defect (fixed)

IE8 query JavaScript errors

Reported by: haysmark Owned by: Kris Zyp
Priority: high Milestone: 1.7
Component: Query Version: 1.6.1
Keywords: dohfail Cc:
Blocked By: Blocking:

Description

See: http://archive.dojotoolkit.org/nightly/checkout/dojo/tests/_base/query.html

In IE8 on Windows XP I am getting runtime errors:

FAILED test: ../../dojo/tests/_base/query.html::t::doh.is(3, (queryLite('[foo]')).length); unknown error 78ms
FAILED test: ../../dojo/tests/_base/query.html::t::doh.is(2, queryLite('> [qux]', 'container').length); unknown error 94ms
FAILED test: ../../dojo/tests/_base/query.html::t::doh.is('child1', queryLite('> [qux]', 'container')[0].id); unknown error 93ms
FAILED test: ../../dojo/tests/_base/query.html::t::doh.is('child3', queryLite('> [qux]', 'container')[1].id); unknown error 109ms

All I see in the console is [object Error].

Change History (5)

comment:1 Changed 8 years ago by haysmark

Owner: alex deleted

comment:2 Changed 8 years ago by bill

Owner: set to Kris Zyp

Kris wrote the lite engine...

comment:3 Changed 8 years ago by bill

Keywords: dohfail added

add keyword to denote test failures in our automated tests

comment:4 Changed 8 years ago by Kris Zyp

Resolution: fixed
Status: newclosed

(In [25315]) Fixes string passed from regex handler for IE8, fixes #13129 !strict

comment:5 Changed 8 years ago by bill

Milestone: tbd1.7
Note: See TracTickets for help on using tickets.