Opened 9 years ago

Closed 7 years ago

Last modified 8 years ago

#12048 closed defect (wontfix)

Opera: form.module ComboBox_a11y test failures

Reported by: Katie Vance Owned by: Katie Vance
Priority: low Milestone: future
Component: Dijit - Form Version: 1.5
Keywords: opera Cc: Douglas Hays
Blocked By: Blocking:

Description

There are many test failures:

Results were:

assertTrue('false') failed with hint: popup hidden FAILED test: ../../dijit/tests/form/robot/_autoComplete_a11y.html?testWidget=dijit.form.ComboBox::enter key::submit 3500 ms

FAILED test: ../../dijit/tests/form/robot/_autoComplete_a11y.html?testWidget=dijit.form.ComboBox::drop down navigation / keyboard::setvaluetest_a11y 60127 ms

assertTrue('false') failed with hint: drop down is visible

FAILED test: ../../dijit/tests/form/robot/_autoComplete_a11y.html?testWidget=dijit.form.ComboBox::filtering of drop down::type 'o' after 'C' 11799 ms

assertTrue('false') failed with hint: drop down is visible

FAILED test: ../../dijit/tests/form/robot/_autoComplete_a11y.html?testWidget=dijit.form.ComboBox::filtering of drop down::type backspace 3699 ms

assertEqual() failed:

expected

Colorado

but got

Californiao

with hint: suggestion changed from California to Colorado

FAILED test: ../../dijit/tests/form/robot/_autoComplete_a11y.html?testWidget=dijit.form.ComboBox::auto-complete::auto-complete changes suggestion based on more typed letters 3698 ms

assertEqual() failed:

expected

Colorado

but got

American Samoa

FAILED test: ../../dijit/tests/form/robot/_autoComplete_a11y.html?testWidget=dijit.form.ComboBox::auto-complete::tab-away auto-selects value 4100 ms

assertEqual() failed:

expected

datatestDijit

but got

slow

with hint: focused on elem before disabled combo

FAILED test: ../../dijit/tests/form/robot/_autoComplete_a11y.html?testWidget=dijit.form.ComboBox::disabled::tab over disabled elements 22 ms

assertEqual() failed:

expected

more\less

but got

rags --> riches

with hint: combo.get(value)

FAILED test: ../../dijit/tests/form/robot/_autoComplete_a11y.html?testWidget=dijit.form.ComboBox::specialchars::specialchars_a11y 11901 ms

assertEqual() failed:

expected

?? (East)

but got

?? (Tokyo)

with hint: combo.get(value)

FAILED test: ../../dijit/tests/form/robot/_autoComplete_a11y.html?testWidget=dijit.form.ComboBox::japanese::japanese_a11y 12201 ms

FAILED test: ../../dijit/tests/form/robot/_autoComplete_a11y.html?testWidget=dijit.form.ComboBox::japanese::japanese_type 9598 ms

assertEqual() failed:

expected

texas

but got

tennessee

with hint: combo.get(value)

FAILED test: ../../dijit/tests/form/robot/_autoComplete_a11y.html?testWidget=dijit.form.ComboBox::labelFunc::labelFunc_a11y 26901 ms

assertTrue('false') failed with hint: drop down is visible FAILED test: ../../dijit/tests/form/robot/_autoComplete_a11y.html?testWidget=dijit.form.ComboBox::filter and sort params::initial filter, descending sort 3479 ms

assertTrue('false') failed with hint: required field has error on blur

FAILED test: ../../dijit/tests/form/robot/_autoComplete_a11y.html?testWidget=dijit.form.ComboBox::blur::empty but required 4701 ms

assertEqual() failed:

expected

Maine

but got

Massachusetts

with hint: Previous choice reverts value

FAILED test: ../../dijit/tests/form/robot/_autoComplete_a11y.html?testWidget=dijit.form.ComboBox::wrap::wrap and TAB from Prev choices 7950 ms

assertEqual() failed:

expected

not called

but got

called

with hint: onChange should not have been called

FAILED test: ../../dijit/tests/form/robot/_autoComplete_a11y.html?testWidget=dijit.form.ComboBox::onChange::11062 3598 ms

FAILED test: ../../dijit/tests/form/robot/_autoComplete_a11y.html?testWidget=dijit.form.ComboBox::onChange::10988.0 2000 ms

FAILED test: ../../dijit/tests/form/robot/_autoComplete_a11y.html?testWidget=dijit.form.ComboBox::onChange::10988.2 2001 ms

FAILED test: ../../dijit/tests/form/robot/_autoComplete_a11y.html?testWidget=dijit.form.ComboBox::onChange::10988.4 2001 ms

FAILED test: ../../dijit/tests/form/robot/_autoComplete_a11y.html?testWidget=dijit.form.ComboBox::onChange::10988.6 2002 ms

FAILED test: ../../dijit/tests/form/robot/_autoComplete_a11y.html?testWidget=dijit.form.ComboBox::destroy::destroy 1001 ms

assertTrue('false') failed with hint: too many menu items: Aa FAILED test: ../../dijit/tests/form/robot/_autoComplete_a11y.html?testWidget=dijit.form.ComboBox::highlight::{"ignoreCase":false,"highlightMatch":"first","queryExpr":"${0}*"} 4701 ms

assertEqual() failed:

expected

<>A<>A

but got

<>AA<>

with hint: AA

FAILED test: ../../dijit/tests/form/robot/_autoComplete_a11y.html?testWidget=dijit.form.ComboBox::highlight::{"ignoreCase":true,"highlightMatch":"all","queryExpr":"${0}*"} 4699 ms

assertEqual() failed:

expected

<>A<><>A<>

but got

<>AA<>

with hint: AA

FAILED test: ../../dijit/tests/form/robot/_autoComplete_a11y.html?testWidget=dijit.form.ComboBox::highlight::{"ignoreCase":true,"highlightMatch":"all","queryExpr":"*${0}*"} 4822 ms

assertEqual() failed:

expected

A<>a<>

but got

<>Aa<>

with hint: Aa

FAILED test: ../../dijit/tests/form/robot/_autoComplete_a11y.html?testWidget=dijit.form.ComboBox::highlight::{"ignoreCase":false,"highlightMatch":"all","queryExpr":"*${0}*"} 4579 ms

assertEqual() failed:

expected

aA

but got

More choices

with hint: aA

FAILED test: ../../dijit/tests/form/robot/_autoComplete_a11y.html?testWidget=dijit.form.ComboBox::highlight::{"ignoreCase":false,"highlightMatch":"none","queryExpr":"*${0}*"} 4700 ms

assertEqual() failed:

expected

A<>A<>

but got

<>AA<>

with hint: AA

FAILED test: ../../dijit/tests/form/robot/_autoComplete_a11y.html?testWidget=dijit.form.ComboBox::highlight::{"ignoreCase":true,"highlightMatch":"all","queryExpr":"*${0}"} 4700 ms

assertEqual() failed:

expected

A<>a<>

but got

<>Aa<>

with hint: Aa

FAILED test: ../../dijit/tests/form/robot/_autoComplete_a11y.html?testWidget=dijit.form.ComboBox::highlight::{"ignoreCase":false,"highlightMatch":"first","queryExpr":"*${0}"} 4700 ms ------------------------------------------------------------ | TEST SUMMARY: ------------------------------------------------------------

1205 tests in 41 groups 7 errors 20 failures

Change History (3)

comment:1 Changed 8 years ago by bill

Component: DijitDijit - Form

comment:2 Changed 7 years ago by bill

Priority: highlow

comment:3 Changed 7 years ago by bill

Resolution: wontfix
Status: newclosed

Since Opera is switching to the webkit rendering engine, closing this ticket. If it's still an issue after the switchover, we can look at it again.

Note: See TracTickets for help on using tickets.