Opened 8 years ago

Closed 6 years ago

#12029 closed defect (wontfix)

Opera: general-module TooltipDialog_a11y test failures

Reported by: Katie Vance Owned by: Katie Vance
Priority: low Milestone: future
Component: Dijit Version: 1.5
Keywords: opera Cc: Douglas Hays
Blocked By: Blocking:

Description

All tests in TooltipDialog_a11y are failing except for the very first one.

Results were:

DEBUG: _AssertFailure: doh._AssertFailure: assertTrue('undefined') failed with hint:

TooltipDialog? should be showing

: assertTrue('undefined') failed with hint:

TooltipDialog? should be showing

... DEBUG: FAILED test: ../../dijit/tests/robot/TooltipDialog_a11y.html::TooltipDialog? normal operation::basic navigation 3502 ms

DEBUG: _AssertFailure: doh._AssertFailure: assertTrue('undefined') failed with hint:

TooltipDialog? should be showing

: assertTrue('undefined') failed with hint:

TooltipDialog? should be showing

... DEBUG: FAILED test: ../../dijit/tests/robot/TooltipDialog_a11y.html::TooltipDialog? normal operation::nested popup 8500 ms

DEBUG: _AssertFailure: doh._AssertFailure: assertTrue('undefined') failed with hint:

TooltipDialog? should be showing

: assertTrue('undefined') failed with hint:

TooltipDialog? should be showing

... DEBUG: FAILED test: ../../dijit/tests/robot/TooltipDialog_a11y.html::interacton with autosave InlineEditBox::InlineEditBox? edit mode, change value, then Esc 5501 ms

DEBUG: _AssertFailure: doh._AssertFailure: assertTrue('undefined') failed with hint:

TooltipDialog? should be showing

: assertTrue('undefined') failed with hint:

TooltipDialog? should be showing

... DEBUG: FAILED test: ../../dijit/tests/robot/TooltipDialog_a11y.html::interacton with autosave InlineEditBox::InlineEditBox? edit mode, change value, then Tab 5603 ms

DEBUG: _AssertFailure: doh._AssertFailure: assertTrue('undefined') failed with hint:

TooltipDialog? should be showing

: assertTrue('undefined') failed with hint:

TooltipDialog? should be showing

... DEBUG: FAILED test: ../../dijit/tests/robot/TooltipDialog_a11y.html::interacton with autosave InlineEditBox::InlineEditBox? edit mode, change value, then Enter 5600 ms

DEBUG: _AssertFailure: doh._AssertFailure: assertTrue('undefined') failed with hint:

TooltipDialog? should be showing

: assertTrue('undefined') failed with hint:

TooltipDialog? should be showing

... DEBUG: FAILED test: ../../dijit/tests/robot/TooltipDialog_a11y.html::interacton with autosave InlineEditBox::InlineEditBox? double edit (esc, enter) 5605 ms

DEBUG: _AssertFailure: doh._AssertFailure: assertTrue('undefined') failed with hint:

TooltipDialog? should be showing

: assertTrue('undefined') failed with hint:

TooltipDialog? should be showing

... DEBUG: FAILED test: ../../dijit/tests/robot/TooltipDialog_a11y.html::interacton with autosave InlineEditBox::InlineEditBox? double edit (enter, enter) 7997 ms

DEBUG: _AssertFailure: doh._AssertFailure: assertTrue('undefined') failed with hint:

TooltipDialog? should be showing

: assertTrue('undefined') failed with hint:

TooltipDialog? should be showing

... DEBUG: FAILED test: ../../dijit/tests/robot/TooltipDialog_a11y.html::interacton with autosave InlineEditBox::InlineEditBox? focused after Tab/Shift?+Tab 9200 ms

Change History (2)

comment:1 Changed 6 years ago by bill

Priority: highlow

comment:2 Changed 6 years ago by bill

Resolution: wontfix
Status: newclosed

Given that Opera is switching to the webkit engine, it doesn't make sense to look at these tickets. We can re-evaluate behavior of dijit on opera after the switch.

Note: See TracTickets for help on using tickets.