Changes between Initial Version and Version 13 of Ticket #11279


Ignore:
Timestamp:
Jun 18, 2010, 2:37:59 PM (10 years ago)
Author:
Adam Peller
Comment:

invalid Date bug: https://bugs.webkit.org/show_bug.cgi?id=40820

Legend:

Unmodified
Added
Removed
Modified
  • Ticket #11279

    • Property Version changed from 1.5.0b2 to 1.5.0rc1
    • Property Type changed from enhancement to defect
    • Property Milestone changed from tbd to 1.5
  • Ticket #11279 – Description

    initial v13  
    661 Dojo core testcase failure:
    77
     8{{{
    89    _AssertFailure: doh._AssertFailure: assertTrue('false') failed: assertTrue('false') failed
    910     ERROR IN:
     
    2021                                                }
    2122 FAILED test: ../../dojo/tests/parser.html::t::testDateProp 1 ms
     23}}}
    2224
    2325================
     
    2527Numerous Dijit testcase failures (not sure if these are just known limitations on Safari 4 for a11y...most seem to be for a11y support)
    2628
     29{{{
    2730FAILED test: ../../dijit/tests/robot/TooltipDialog_a11y.html::interacton with autosave InlineEditBox::InlineEditBox edit mode, change value, then Tab 5104 ms
    2831     _AssertFailure: doh._AssertFailure: assertEqual() failed:
     
    983986                                                }
    984987 FAILED test: ../../dijit/tests/editor/robot/Editor_LinkDialog.html::LinkDialog_tests::Image Tag: Single click selects image. 4212 ms
     988}}}
    985989 -----
    986990Numerous form validation errors