Opened 9 years ago

Closed 9 years ago

#11211 closed defect (fixed)

validationMessages test failures (mac)

Reported by: bill Owned by: Douglas Hays
Priority: high Milestone: 1.5
Component: Dijit Version: 1.5.0b2
Keywords: Cc:
Blocked By: Blocking:

Description

Getting 16 failures on safari/mac running validationMessages stand alone. It's running correctly on windows.

GROUP "t00000" has 17 tests to run
PASSED test: t00000 first focus, empty value 702 ms
PASSED test: t00000 first valid character 601 ms
PASSED test: t00000 second valid character 601 ms
PASSED test: t00000 first invalid character 601 ms
PASSED test: t00000 delete invalid character 401 ms
PASSED test: t00000 delete last valid character 401 ms
PASSED test: t00000 delete first valid character 400 ms
PASSED test: t00000 tab from empty 400 ms
PASSED test: t00000 tab back to empty 401 ms
PASSED test: t00000 first valid character after refocus 601 ms
PASSED test: t00000 out of range after refocus 1002 ms
PASSED test: t00000 tab from out of range 401 ms
PASSED test: t00000 tab back to out of range 401 ms
PASSED test: t00000 delete out of range character 601 ms
PASSED test: t00000 delete remaining characters 601 ms
PASSED test: t00000 tab from empty 2 401 ms
Total time for GROUP " t00000 " is  8.5s
PASSED test: t00000 tab back to empty 2 401 ms
Total time for GROUP " t00000 " is  8.9s
------------------------------------------------------------
GROUP "t00001" has 17 tests to run
PASSED test: t00001 first focus, empty value 1701 ms
PASSED test: t00001 first valid character 600 ms
PASSED test: t00001 second valid character 600 ms
PASSED test: t00001 first invalid character 600 ms
PASSED test: t00001 delete invalid character 401 ms
PASSED test: t00001 delete last valid character 401 ms
PASSED test: t00001 delete first valid character 401 ms
PASSED test: t00001 tab from empty 400 ms
PASSED test: t00001 tab back to empty 401 ms
PASSED test: t00001 first valid character after refocus 601 ms
PASSED test: t00001 out of range after refocus 1001 ms
PASSED test: t00001 tab from out of range 401 ms
PASSED test: t00001 tab back to out of range 401 ms
PASSED test: t00001 delete out of range character 601 ms
PASSED test: t00001 delete remaining characters 600 ms
PASSED test: t00001 tab from empty 2 401 ms
Total time for GROUP " t00001 " is  9.5s
PASSED test: t00001 tab back to empty 2 400 ms
Total time for GROUP " t00001 " is  9.9s
------------------------------------------------------------
GROUP "t00010" has 17 tests to run
PASSED test: t00010 first focus, empty value 1701 ms
PASSED test: t00010 first valid character 601 ms
PASSED test: t00010 second valid character 601 ms
PASSED test: t00010 first invalid character 600 ms
PASSED test: t00010 delete invalid character 401 ms
PASSED test: t00010 delete last valid character 402 ms
PASSED test: t00010 delete first valid character 400 ms
PASSED test: t00010 tab from empty 401 ms
PASSED test: t00010 tab back to empty 401 ms
PASSED test: t00010 first valid character after refocus 601 ms
PASSED test: t00010 out of range after refocus 1001 ms
PASSED test: t00010 tab from out of range 401 ms
PASSED test: t00010 tab back to out of range 401 ms
PASSED test: t00010 delete out of range character 601 ms
PASSED test: t00010 delete remaining characters 600 ms
PASSED test: t00010 tab from empty 2 401 ms
Total time for GROUP " t00010 " is  9.5s
PASSED test: t00010 tab back to empty 2 400 ms
Total time for GROUP " t00010 " is  9.9s
------------------------------------------------------------
GROUP "t00011" has 17 tests to run
PASSED test: t00011 first focus, empty value 1701 ms
PASSED test: t00011 first valid character 601 ms
PASSED test: t00011 second valid character 602 ms
PASSED test: t00011 first invalid character 600 ms
PASSED test: t00011 delete invalid character 401 ms
PASSED test: t00011 delete last valid character 401 ms
PASSED test: t00011 delete first valid character 401 ms
PASSED test: t00011 tab from empty 401 ms
PASSED test: t00011 tab back to empty 400 ms
PASSED test: t00011 first valid character after refocus 601 ms
PASSED test: t00011 out of range after refocus 1001 ms
PASSED test: t00011 tab from out of range 401 ms
PASSED test: t00011 tab back to out of range 401 ms
PASSED test: t00011 delete out of range character 601 ms
PASSED test: t00011 delete remaining characters 600 ms
PASSED test: t00011 tab from empty 2 401 ms
Total time for GROUP " t00011 " is  9.5s
PASSED test: t00011 tab back to empty 2 400 ms
Total time for GROUP " t00011 " is  9.9s
------------------------------------------------------------
GROUP "t00100" has 17 tests to run
PASSED test: t00100 first focus, empty value 1701 ms
PASSED test: t00100 first valid character 601 ms
PASSED test: t00100 second valid character 601 ms
PASSED test: t00100 first invalid character 600 ms
PASSED test: t00100 delete invalid character 402 ms
PASSED test: t00100 delete last valid character 401 ms
PASSED test: t00100 delete first valid character 400 ms
PASSED test: t00100 tab from empty 401 ms
PASSED test: t00100 tab back to empty 401 ms
PASSED test: t00100 first valid character after refocus 601 ms
PASSED test: t00100 out of range after refocus 1001 ms
PASSED test: t00100 tab from out of range 401 ms
PASSED test: t00100 tab back to out of range 401 ms
PASSED test: t00100 delete out of range character 601 ms
PASSED test: t00100 delete remaining characters 600 ms
PASSED test: t00100 tab from empty 2 401 ms
Total time for GROUP " t00100 " is  9.5s
PASSED test: t00100 tab back to empty 2 401 ms
Total time for GROUP " t00100 " is  9.9s
------------------------------------------------------------
GROUP "t00101" has 17 tests to run
PASSED test: t00101 first focus, empty value 1701 ms
PASSED test: t00101 first valid character 601 ms
PASSED test: t00101 second valid character 602 ms
PASSED test: t00101 first invalid character 600 ms
PASSED test: t00101 delete invalid character 401 ms
PASSED test: t00101 delete last valid character 401 ms
PASSED test: t00101 delete first valid character 400 ms
PASSED test: t00101 tab from empty 400 ms
PASSED test: t00101 tab back to empty 401 ms
PASSED test: t00101 first valid character after refocus 601 ms
PASSED test: t00101 out of range after refocus 1001 ms
PASSED test: t00101 tab from out of range 401 ms
PASSED test: t00101 tab back to out of range 401 ms
PASSED test: t00101 delete out of range character 600 ms
PASSED test: t00101 delete remaining characters 601 ms
PASSED test: t00101 tab from empty 2 400 ms
Total time for GROUP " t00101 " is  9.5s
PASSED test: t00101 tab back to empty 2 401 ms
Total time for GROUP " t00101 " is  9.9s
------------------------------------------------------------
GROUP "t00110" has 17 tests to run
PASSED test: t00110 first focus, empty value 1702 ms
PASSED test: t00110 first valid character 601 ms
PASSED test: t00110 second valid character 601 ms
PASSED test: t00110 first invalid character 601 ms
PASSED test: t00110 delete invalid character 401 ms
PASSED test: t00110 delete last valid character 401 ms
PASSED test: t00110 delete first valid character 401 ms
PASSED test: t00110 tab from empty 400 ms
PASSED test: t00110 tab back to empty 400 ms
PASSED test: t00110 first valid character after refocus 601 ms
PASSED test: t00110 out of range after refocus 1001 ms
PASSED test: t00110 tab from out of range 401 ms
PASSED test: t00110 tab back to out of range 401 ms
PASSED test: t00110 delete out of range character 601 ms
PASSED test: t00110 delete remaining characters 600 ms
PASSED test: t00110 tab from empty 2 401 ms
Total time for GROUP " t00110 " is  9.5s
PASSED test: t00110 tab back to empty 2 401 ms
Total time for GROUP " t00110 " is  9.9s
------------------------------------------------------------
GROUP "t00111" has 17 tests to run
PASSED test: t00111 first focus, empty value 1701 ms
PASSED test: t00111 first valid character 602 ms
PASSED test: t00111 second valid character 601 ms
PASSED test: t00111 first invalid character 601 ms
PASSED test: t00111 delete invalid character 401 ms
PASSED test: t00111 delete last valid character 401 ms
PASSED test: t00111 delete first valid character 401 ms
PASSED test: t00111 tab from empty 400 ms
PASSED test: t00111 tab back to empty 401 ms
PASSED test: t00111 first valid character after refocus 601 ms
PASSED test: t00111 out of range after refocus 1001 ms
PASSED test: t00111 tab from out of range 401 ms
PASSED test: t00111 tab back to out of range 400 ms
PASSED test: t00111 delete out of range character 600 ms
PASSED test: t00111 delete remaining characters 601 ms
PASSED test: t00111 tab from empty 2 400 ms
Total time for GROUP " t00111 " is  9.5s
PASSED test: t00111 tab back to empty 2 401 ms
Total time for GROUP " t00111 " is  9.9s
------------------------------------------------------------
GROUP "t01000" has 17 tests to run
PASSED test: t01000 first focus, empty value 1701 ms
PASSED test: t01000 first valid character 602 ms
PASSED test: t01000 second valid character 601 ms
PASSED test: t01000 first invalid character 600 ms
PASSED test: t01000 delete invalid character 401 ms
PASSED test: t01000 delete last valid character 401 ms
PASSED test: t01000 delete first valid character 400 ms
PASSED test: t01000 tab from empty 401 ms
PASSED test: t01000 tab back to empty 400 ms
PASSED test: t01000 first valid character after refocus 601 ms
PASSED test: t01000 out of range after refocus 1001 ms
PASSED test: t01000 tab from out of range 400 ms
PASSED test: t01000 tab back to out of range 401 ms
	_AssertFailure: doh._AssertFailure: assertEqual() failed:
	expected
		true
	but got
		false

 with hint: 
		isValid
: assertEqual() failed:
	expected
		true
	but got
		false

 with hint: 
		isValid
doh._AssertFailure: assertEqual() failed:
	expected
		true
	but got
		false

 with hint: 
		isValid
	ERROR IN:
		 function () {
										var d = new doh.Deferred();

										doh.robot.keyPress(dojo.keys.END, 200);
										doh.robot.keyPress(dojo.keys.BACKSPACE, 200);

										doh.robot.sequence(d.getTestCallback(function(){
											doh.is(true, textbox.isValid(false), "isValid");
											doh.is("", textbox.state, "state");
											doh.is(promptMessage, textbox._message, "tooltip");
										}), 200);

										return d;
									}
FAILED test: t01000 delete out of range character 602 ms
PASSED test: t01000 delete remaining characters 600 ms
PASSED test: t01000 tab from empty 2 401 ms
Total time for GROUP " t01000 " is  9.5s
PASSED test: t01000 tab back to empty 2 400 ms
Total time for GROUP " t01000 " is  9.9s
------------------------------------------------------------
GROUP "t01001" has 17 tests to run
PASSED test: t01001 first focus, empty value 1701 ms
PASSED test: t01001 first valid character 601 ms
PASSED test: t01001 second valid character 601 ms
PASSED test: t01001 first invalid character 601 ms
PASSED test: t01001 delete invalid character 401 ms
PASSED test: t01001 delete last valid character 401 ms
PASSED test: t01001 delete first valid character 400 ms
PASSED test: t01001 tab from empty 401 ms
PASSED test: t01001 tab back to empty 400 ms
PASSED test: t01001 first valid character after refocus 600 ms
PASSED test: t01001 out of range after refocus 1001 ms
PASSED test: t01001 tab from out of range 402 ms
PASSED test: t01001 tab back to out of range 401 ms
	_AssertFailure: doh._AssertFailure: assertEqual() failed:
	expected
		true
	but got
		false

 with hint: 
		isValid
: assertEqual() failed:
	expected
		true
	but got
		false

 with hint: 
		isValid
doh._AssertFailure: assertEqual() failed:
	expected
		true
	but got
		false

 with hint: 
		isValid
	ERROR IN:
		 function () {
										var d = new doh.Deferred();

										doh.robot.keyPress(dojo.keys.END, 200);
										doh.robot.keyPress(dojo.keys.BACKSPACE, 200);

										doh.robot.sequence(d.getTestCallback(function(){
											doh.is(true, textbox.isValid(false), "isValid");
											doh.is("", textbox.state, "state");
											doh.is(promptMessage, textbox._message, "tooltip");
										}), 200);

										return d;
									}
FAILED test: t01001 delete out of range character 601 ms
PASSED test: t01001 delete remaining characters 601 ms
PASSED test: t01001 tab from empty 2 400 ms
Total time for GROUP " t01001 " is  9.5s
PASSED test: t01001 tab back to empty 2 401 ms
Total time for GROUP " t01001 " is  9.9s
------------------------------------------------------------
GROUP "t01010" has 17 tests to run
PASSED test: t01010 first focus, empty value 1702 ms
PASSED test: t01010 first valid character 601 ms
PASSED test: t01010 second valid character 601 ms
PASSED test: t01010 first invalid character 601 ms
PASSED test: t01010 delete invalid character 401 ms
PASSED test: t01010 delete last valid character 401 ms
PASSED test: t01010 delete first valid character 401 ms
PASSED test: t01010 tab from empty 401 ms
PASSED test: t01010 tab back to empty 400 ms
PASSED test: t01010 first valid character after refocus 601 ms
PASSED test: t01010 out of range after refocus 1001 ms
PASSED test: t01010 tab from out of range 401 ms
PASSED test: t01010 tab back to out of range 401 ms
	_AssertFailure: doh._AssertFailure: assertEqual() failed:
	expected
		true
	but got
		false

 with hint: 
		isValid
: assertEqual() failed:
	expected
		true
	but got
		false

 with hint: 
		isValid
doh._AssertFailure: assertEqual() failed:
	expected
		true
	but got
		false

 with hint: 
		isValid
	ERROR IN:
		 function () {
										var d = new doh.Deferred();

										doh.robot.keyPress(dojo.keys.END, 200);
										doh.robot.keyPress(dojo.keys.BACKSPACE, 200);

										doh.robot.sequence(d.getTestCallback(function(){
											doh.is(true, textbox.isValid(false), "isValid");
											doh.is("", textbox.state, "state");
											doh.is(promptMessage, textbox._message, "tooltip");
										}), 200);

										return d;
									}
FAILED test: t01010 delete out of range character 601 ms
PASSED test: t01010 delete remaining characters 600 ms
PASSED test: t01010 tab from empty 2 400 ms
Total time for GROUP " t01010 " is  9.5s
PASSED test: t01010 tab back to empty 2 401 ms
Total time for GROUP " t01010 " is  9.9s
------------------------------------------------------------
GROUP "t01011" has 17 tests to run
PASSED test: t01011 first focus, empty value 1701 ms
PASSED test: t01011 first valid character 601 ms
PASSED test: t01011 second valid character 601 ms
PASSED test: t01011 first invalid character 600 ms
PASSED test: t01011 delete invalid character 402 ms
PASSED test: t01011 delete last valid character 401 ms
PASSED test: t01011 delete first valid character 400 ms
PASSED test: t01011 tab from empty 401 ms
PASSED test: t01011 tab back to empty 400 ms
PASSED test: t01011 first valid character after refocus 600 ms
PASSED test: t01011 out of range after refocus 1002 ms
PASSED test: t01011 tab from out of range 401 ms
PASSED test: t01011 tab back to out of range 401 ms
	_AssertFailure: doh._AssertFailure: assertEqual() failed:
	expected
		true
	but got
		false

 with hint: 
		isValid
: assertEqual() failed:
	expected
		true
	but got
		false

 with hint: 
		isValid
doh._AssertFailure: assertEqual() failed:
	expected
		true
	but got
		false

 with hint: 
		isValid
	ERROR IN:
		 function () {
										var d = new doh.Deferred();

										doh.robot.keyPress(dojo.keys.END, 200);
										doh.robot.keyPress(dojo.keys.BACKSPACE, 200);

										doh.robot.sequence(d.getTestCallback(function(){
											doh.is(true, textbox.isValid(false), "isValid");
											doh.is("", textbox.state, "state");
											doh.is(promptMessage, textbox._message, "tooltip");
										}), 200);

										return d;
									}
FAILED test: t01011 delete out of range character 601 ms
PASSED test: t01011 delete remaining characters 600 ms
PASSED test: t01011 tab from empty 2 401 ms
Total time for GROUP " t01011 " is  9.5s
PASSED test: t01011 tab back to empty 2 400 ms
Total time for GROUP " t01011 " is  9.9s
------------------------------------------------------------
GROUP "t01100" has 17 tests to run
PASSED test: t01100 first focus, empty value 1702 ms
PASSED test: t01100 first valid character 601 ms
PASSED test: t01100 second valid character 601 ms
PASSED test: t01100 first invalid character 601 ms
PASSED test: t01100 delete invalid character 401 ms
PASSED test: t01100 delete last valid character 401 ms
PASSED test: t01100 delete first valid character 401 ms
PASSED test: t01100 tab from empty 401 ms
PASSED test: t01100 tab back to empty 400 ms
PASSED test: t01100 first valid character after refocus 601 ms
PASSED test: t01100 out of range after refocus 1001 ms
PASSED test: t01100 tab from out of range 400 ms
PASSED test: t01100 tab back to out of range 402 ms
	_AssertFailure: doh._AssertFailure: assertEqual() failed:
	expected
		true
	but got
		false

 with hint: 
		isValid
: assertEqual() failed:
	expected
		true
	but got
		false

 with hint: 
		isValid
doh._AssertFailure: assertEqual() failed:
	expected
		true
	but got
		false

 with hint: 
		isValid
	ERROR IN:
		 function () {
										var d = new doh.Deferred();

										doh.robot.keyPress(dojo.keys.END, 200);
										doh.robot.keyPress(dojo.keys.BACKSPACE, 200);

										doh.robot.sequence(d.getTestCallback(function(){
											doh.is(true, textbox.isValid(false), "isValid");
											doh.is("", textbox.state, "state");
											doh.is(promptMessage, textbox._message, "tooltip");
										}), 200);

										return d;
									}
FAILED test: t01100 delete out of range character 600 ms
PASSED test: t01100 delete remaining characters 601 ms
PASSED test: t01100 tab from empty 2 401 ms
Total time for GROUP " t01100 " is  9.5s
PASSED test: t01100 tab back to empty 2 400 ms
Total time for GROUP " t01100 " is  9.9s
------------------------------------------------------------
GROUP "t01101" has 17 tests to run
PASSED test: t01101 first focus, empty value 1702 ms
PASSED test: t01101 first valid character 607 ms
PASSED test: t01101 second valid character 601 ms
PASSED test: t01101 first invalid character 601 ms
PASSED test: t01101 delete invalid character 401 ms
PASSED test: t01101 delete last valid character 401 ms
PASSED test: t01101 delete first valid character 400 ms
PASSED test: t01101 tab from empty 401 ms
PASSED test: t01101 tab back to empty 400 ms
PASSED test: t01101 first valid character after refocus 601 ms
PASSED test: t01101 out of range after refocus 1001 ms
PASSED test: t01101 tab from out of range 401 ms
PASSED test: t01101 tab back to out of range 401 ms
	_AssertFailure: doh._AssertFailure: assertEqual() failed:
	expected
		true
	but got
		false

 with hint: 
		isValid
: assertEqual() failed:
	expected
		true
	but got
		false

 with hint: 
		isValid
doh._AssertFailure: assertEqual() failed:
	expected
		true
	but got
		false

 with hint: 
		isValid
	ERROR IN:
		 function () {
										var d = new doh.Deferred();

										doh.robot.keyPress(dojo.keys.END, 200);
										doh.robot.keyPress(dojo.keys.BACKSPACE, 200);

										doh.robot.sequence(d.getTestCallback(function(){
											doh.is(true, textbox.isValid(false), "isValid");
											doh.is("", textbox.state, "state");
											doh.is(promptMessage, textbox._message, "tooltip");
										}), 200);

										return d;
									}
FAILED test: t01101 delete out of range character 601 ms
PASSED test: t01101 delete remaining characters 600 ms
PASSED test: t01101 tab from empty 2 401 ms
Total time for GROUP " t01101 " is  9.5s
PASSED test: t01101 tab back to empty 2 400 ms
Total time for GROUP " t01101 " is  9.9s
------------------------------------------------------------
GROUP "t01110" has 17 tests to run
PASSED test: t01110 first focus, empty value 1701 ms
PASSED test: t01110 first valid character 601 ms
PASSED test: t01110 second valid character 601 ms
PASSED test: t01110 first invalid character 601 ms
PASSED test: t01110 delete invalid character 401 ms
PASSED test: t01110 delete last valid character 402 ms
PASSED test: t01110 delete first valid character 400 ms
PASSED test: t01110 tab from empty 401 ms
PASSED test: t01110 tab back to empty 400 ms
PASSED test: t01110 first valid character after refocus 602 ms
PASSED test: t01110 out of range after refocus 1001 ms
PASSED test: t01110 tab from out of range 401 ms
PASSED test: t01110 tab back to out of range 401 ms
	_AssertFailure: doh._AssertFailure: assertEqual() failed:
	expected
		true
	but got
		false

 with hint: 
		isValid
: assertEqual() failed:
	expected
		true
	but got
		false

 with hint: 
		isValid
doh._AssertFailure: assertEqual() failed:
	expected
		true
	but got
		false

 with hint: 
		isValid
	ERROR IN:
		 function () {
										var d = new doh.Deferred();

										doh.robot.keyPress(dojo.keys.END, 200);
										doh.robot.keyPress(dojo.keys.BACKSPACE, 200);

										doh.robot.sequence(d.getTestCallback(function(){
											doh.is(true, textbox.isValid(false), "isValid");
											doh.is("", textbox.state, "state");
											doh.is(promptMessage, textbox._message, "tooltip");
										}), 200);

										return d;
									}
FAILED test: t01110 delete out of range character 600 ms
PASSED test: t01110 delete remaining characters 601 ms
PASSED test: t01110 tab from empty 2 400 ms
Total time for GROUP " t01110 " is  9.5s
PASSED test: t01110 tab back to empty 2 401 ms
Total time for GROUP " t01110 " is  9.9s
------------------------------------------------------------
GROUP "t01111" has 17 tests to run
PASSED test: t01111 first focus, empty value 1702 ms
PASSED test: t01111 first valid character 601 ms
PASSED test: t01111 second valid character 601 ms
PASSED test: t01111 first invalid character 600 ms
PASSED test: t01111 delete invalid character 401 ms
PASSED test: t01111 delete last valid character 401 ms
PASSED test: t01111 delete first valid character 400 ms
PASSED test: t01111 tab from empty 401 ms
PASSED test: t01111 tab back to empty 400 ms
PASSED test: t01111 first valid character after refocus 601 ms
PASSED test: t01111 out of range after refocus 1001 ms
PASSED test: t01111 tab from out of range 407 ms
PASSED test: t01111 tab back to out of range 402 ms
	_AssertFailure: doh._AssertFailure: assertEqual() failed:
	expected
		true
	but got
		false

 with hint: 
		isValid
: assertEqual() failed:
	expected
		true
	but got
		false

 with hint: 
		isValid
doh._AssertFailure: assertEqual() failed:
	expected
		true
	but got
		false

 with hint: 
		isValid
	ERROR IN:
		 function () {
										var d = new doh.Deferred();

										doh.robot.keyPress(dojo.keys.END, 200);
										doh.robot.keyPress(dojo.keys.BACKSPACE, 200);

										doh.robot.sequence(d.getTestCallback(function(){
											doh.is(true, textbox.isValid(false), "isValid");
											doh.is("", textbox.state, "state");
											doh.is(promptMessage, textbox._message, "tooltip");
										}), 200);

										return d;
									}
FAILED test: t01111 delete out of range character 601 ms
PASSED test: t01111 delete remaining characters 600 ms
PASSED test: t01111 tab from empty 2 401 ms
Total time for GROUP " t01111 " is  9.5s
PASSED test: t01111 tab back to empty 2 401 ms
Total time for GROUP " t01111 " is  9.9s
------------------------------------------------------------
GROUP "t10000" has 17 tests to run
PASSED test: t10000 first focus, empty value 1701 ms
PASSED test: t10000 first valid character 600 ms
PASSED test: t10000 second valid character 601 ms
PASSED test: t10000 first invalid character 601 ms
PASSED test: t10000 delete invalid character 401 ms
PASSED test: t10000 delete last valid character 400 ms
PASSED test: t10000 delete first valid character 401 ms
PASSED test: t10000 tab from empty 400 ms
PASSED test: t10000 tab back to empty 400 ms
PASSED test: t10000 first valid character after refocus 601 ms
PASSED test: t10000 out of range after refocus 1000 ms
PASSED test: t10000 tab from out of range 401 ms
PASSED test: t10000 tab back to out of range 401 ms
PASSED test: t10000 delete out of range character 601 ms
PASSED test: t10000 delete remaining characters 600 ms
PASSED test: t10000 tab from empty 2 401 ms
Total time for GROUP " t10000 " is  9.5s
PASSED test: t10000 tab back to empty 2 400 ms
Total time for GROUP " t10000 " is  9.9s
------------------------------------------------------------
GROUP "t10001" has 17 tests to run
PASSED test: t10001 first focus, empty value 1701 ms
PASSED test: t10001 first valid character 601 ms
PASSED test: t10001 second valid character 601 ms
PASSED test: t10001 first invalid character 601 ms
PASSED test: t10001 delete invalid character 401 ms
PASSED test: t10001 delete last valid character 400 ms
PASSED test: t10001 delete first valid character 401 ms
PASSED test: t10001 tab from empty 401 ms
PASSED test: t10001 tab back to empty 400 ms
PASSED test: t10001 first valid character after refocus 601 ms
PASSED test: t10001 out of range after refocus 1001 ms
PASSED test: t10001 tab from out of range 401 ms
PASSED test: t10001 tab back to out of range 400 ms
PASSED test: t10001 delete out of range character 601 ms
PASSED test: t10001 delete remaining characters 600 ms
PASSED test: t10001 tab from empty 2 401 ms
Total time for GROUP " t10001 " is  9.5s
PASSED test: t10001 tab back to empty 2 400 ms
Total time for GROUP " t10001 " is  9.9s
------------------------------------------------------------
GROUP "t10010" has 17 tests to run
PASSED test: t10010 first focus, empty value 1701 ms
PASSED test: t10010 first valid character 601 ms
PASSED test: t10010 second valid character 601 ms
PASSED test: t10010 first invalid character 601 ms
PASSED test: t10010 delete invalid character 401 ms
PASSED test: t10010 delete last valid character 401 ms
PASSED test: t10010 delete first valid character 400 ms
PASSED test: t10010 tab from empty 401 ms
PASSED test: t10010 tab back to empty 401 ms
PASSED test: t10010 first valid character after refocus 600 ms
PASSED test: t10010 out of range after refocus 1001 ms
PASSED test: t10010 tab from out of range 401 ms
PASSED test: t10010 tab back to out of range 400 ms
PASSED test: t10010 delete out of range character 601 ms
PASSED test: t10010 delete remaining characters 601 ms
PASSED test: t10010 tab from empty 2 401 ms
Total time for GROUP " t10010 " is  9.5s
PASSED test: t10010 tab back to empty 2 400 ms
Total time for GROUP " t10010 " is  9.9s
------------------------------------------------------------
GROUP "t10011" has 17 tests to run
PASSED test: t10011 first focus, empty value 1702 ms
PASSED test: t10011 first valid character 601 ms
PASSED test: t10011 second valid character 601 ms
PASSED test: t10011 first invalid character 600 ms
PASSED test: t10011 delete invalid character 401 ms
PASSED test: t10011 delete last valid character 401 ms
PASSED test: t10011 delete first valid character 400 ms
PASSED test: t10011 tab from empty 400 ms
PASSED test: t10011 tab back to empty 401 ms
PASSED test: t10011 first valid character after refocus 601 ms
PASSED test: t10011 out of range after refocus 1000 ms
PASSED test: t10011 tab from out of range 400 ms
PASSED test: t10011 tab back to out of range 401 ms
PASSED test: t10011 delete out of range character 600 ms
PASSED test: t10011 delete remaining characters 601 ms
PASSED test: t10011 tab from empty 2 400 ms
Total time for GROUP " t10011 " is  9.5s
PASSED test: t10011 tab back to empty 2 401 ms
Total time for GROUP " t10011 " is  9.9s
------------------------------------------------------------
GROUP "t10100" has 17 tests to run
PASSED test: t10100 first focus, empty value 1701 ms
PASSED test: t10100 first valid character 601 ms
PASSED test: t10100 second valid character 601 ms
PASSED test: t10100 first invalid character 601 ms
PASSED test: t10100 delete invalid character 400 ms
PASSED test: t10100 delete last valid character 401 ms
PASSED test: t10100 delete first valid character 401 ms
PASSED test: t10100 tab from empty 400 ms
PASSED test: t10100 tab back to empty 400 ms
PASSED test: t10100 first valid character after refocus 601 ms
PASSED test: t10100 out of range after refocus 1001 ms
PASSED test: t10100 tab from out of range 400 ms
PASSED test: t10100 tab back to out of range 401 ms
PASSED test: t10100 delete out of range character 601 ms
PASSED test: t10100 delete remaining characters 600 ms
PASSED test: t10100 tab from empty 2 401 ms
Total time for GROUP " t10100 " is  9.5s
PASSED test: t10100 tab back to empty 2 400 ms
Total time for GROUP " t10100 " is  9.9s
------------------------------------------------------------
GROUP "t10101" has 17 tests to run
PASSED test: t10101 first focus, empty value 1701 ms
PASSED test: t10101 first valid character 601 ms
PASSED test: t10101 second valid character 601 ms
PASSED test: t10101 first invalid character 600 ms
PASSED test: t10101 delete invalid character 400 ms
PASSED test: t10101 delete last valid character 401 ms
PASSED test: t10101 delete first valid character 401 ms
PASSED test: t10101 tab from empty 400 ms
PASSED test: t10101 tab back to empty 401 ms
PASSED test: t10101 first valid character after refocus 600 ms
PASSED test: t10101 out of range after refocus 1000 ms
PASSED test: t10101 tab from out of range 401 ms
PASSED test: t10101 tab back to out of range 400 ms
PASSED test: t10101 delete out of range character 601 ms
PASSED test: t10101 delete remaining characters 601 ms
PASSED test: t10101 tab from empty 2 400 ms
Total time for GROUP " t10101 " is  9.5s
PASSED test: t10101 tab back to empty 2 401 ms
Total time for GROUP " t10101 " is  9.9s
------------------------------------------------------------
GROUP "t10110" has 17 tests to run
PASSED test: t10110 first focus, empty value 1702 ms
PASSED test: t10110 first valid character 600 ms
PASSED test: t10110 second valid character 602 ms
PASSED test: t10110 first invalid character 600 ms
PASSED test: t10110 delete invalid character 401 ms
PASSED test: t10110 delete last valid character 401 ms
PASSED test: t10110 delete first valid character 401 ms
PASSED test: t10110 tab from empty 400 ms
PASSED test: t10110 tab back to empty 401 ms
PASSED test: t10110 first valid character after refocus 600 ms
PASSED test: t10110 out of range after refocus 1000 ms
PASSED test: t10110 tab from out of range 401 ms
PASSED test: t10110 tab back to out of range 401 ms
PASSED test: t10110 delete out of range character 600 ms
PASSED test: t10110 delete remaining characters 601 ms
PASSED test: t10110 tab from empty 2 400 ms
Total time for GROUP " t10110 " is  9.5s
PASSED test: t10110 tab back to empty 2 401 ms
Total time for GROUP " t10110 " is  9.9s
------------------------------------------------------------
GROUP "t10111" has 17 tests to run
PASSED test: t10111 first focus, empty value 1701 ms
PASSED test: t10111 first valid character 600 ms
PASSED test: t10111 second valid character 601 ms
PASSED test: t10111 first invalid character 601 ms
PASSED test: t10111 delete invalid character 401 ms
PASSED test: t10111 delete last valid character 400 ms
PASSED test: t10111 delete first valid character 400 ms
PASSED test: t10111 tab from empty 401 ms
PASSED test: t10111 tab back to empty 400 ms
PASSED test: t10111 first valid character after refocus 601 ms
PASSED test: t10111 out of range after refocus 1001 ms
PASSED test: t10111 tab from out of range 401 ms
PASSED test: t10111 tab back to out of range 401 ms
PASSED test: t10111 delete out of range character 600 ms
PASSED test: t10111 delete remaining characters 601 ms
PASSED test: t10111 tab from empty 2 400 ms
Total time for GROUP " t10111 " is  9.5s
PASSED test: t10111 tab back to empty 2 400 ms
Total time for GROUP " t10111 " is  9.9s
------------------------------------------------------------
GROUP "t11000" has 17 tests to run
PASSED test: t11000 first focus, empty value 1702 ms
PASSED test: t11000 first valid character 600 ms
PASSED test: t11000 second valid character 600 ms
PASSED test: t11000 first invalid character 601 ms
PASSED test: t11000 delete invalid character 401 ms
PASSED test: t11000 delete last valid character 401 ms
PASSED test: t11000 delete first valid character 400 ms
PASSED test: t11000 tab from empty 401 ms
PASSED test: t11000 tab back to empty 401 ms
PASSED test: t11000 first valid character after refocus 600 ms
PASSED test: t11000 out of range after refocus 1001 ms
PASSED test: t11000 tab from out of range 401 ms
PASSED test: t11000 tab back to out of range 407 ms
	_AssertFailure: doh._AssertFailure: assertEqual() failed:
	expected
		true
	but got
		false

 with hint: 
		isValid
: assertEqual() failed:
	expected
		true
	but got
		false

 with hint: 
		isValid
doh._AssertFailure: assertEqual() failed:
	expected
		true
	but got
		false

 with hint: 
		isValid
	ERROR IN:
		 function () {
										var d = new doh.Deferred();

										doh.robot.keyPress(dojo.keys.END, 200);
										doh.robot.keyPress(dojo.keys.BACKSPACE, 200);

										doh.robot.sequence(d.getTestCallback(function(){
											doh.is(true, textbox.isValid(false), "isValid");
											doh.is("", textbox.state, "state");
											doh.is(promptMessage, textbox._message, "tooltip");
										}), 200);

										return d;
									}
FAILED test: t11000 delete out of range character 601 ms
PASSED test: t11000 delete remaining characters 601 ms
PASSED test: t11000 tab from empty 2 400 ms
Total time for GROUP " t11000 " is  9.5s
PASSED test: t11000 tab back to empty 2 401 ms
Total time for GROUP " t11000 " is  9.9s
------------------------------------------------------------
GROUP "t11001" has 17 tests to run
PASSED test: t11001 first focus, empty value 1702 ms
PASSED test: t11001 first valid character 601 ms
PASSED test: t11001 second valid character 601 ms
PASSED test: t11001 first invalid character 600 ms
PASSED test: t11001 delete invalid character 401 ms
PASSED test: t11001 delete last valid character 401 ms
PASSED test: t11001 delete first valid character 401 ms
PASSED test: t11001 tab from empty 400 ms
PASSED test: t11001 tab back to empty 401 ms
PASSED test: t11001 first valid character after refocus 600 ms
PASSED test: t11001 out of range after refocus 1001 ms
PASSED test: t11001 tab from out of range 401 ms
PASSED test: t11001 tab back to out of range 401 ms
	_AssertFailure: doh._AssertFailure: assertEqual() failed:
	expected
		true
	but got
		false

 with hint: 
		isValid
: assertEqual() failed:
	expected
		true
	but got
		false

 with hint: 
		isValid
doh._AssertFailure: assertEqual() failed:
	expected
		true
	but got
		false

 with hint: 
		isValid
	ERROR IN:
		 function () {
										var d = new doh.Deferred();

										doh.robot.keyPress(dojo.keys.END, 200);
										doh.robot.keyPress(dojo.keys.BACKSPACE, 200);

										doh.robot.sequence(d.getTestCallback(function(){
											doh.is(true, textbox.isValid(false), "isValid");
											doh.is("", textbox.state, "state");
											doh.is(promptMessage, textbox._message, "tooltip");
										}), 200);

										return d;
									}
FAILED test: t11001 delete out of range character 601 ms
PASSED test: t11001 delete remaining characters 600 ms
PASSED test: t11001 tab from empty 2 401 ms
Total time for GROUP " t11001 " is  9.5s
PASSED test: t11001 tab back to empty 2 400 ms
Total time for GROUP " t11001 " is  9.9s
------------------------------------------------------------
GROUP "t11010" has 17 tests to run
PASSED test: t11010 first focus, empty value 1701 ms
PASSED test: t11010 first valid character 601 ms
PASSED test: t11010 second valid character 601 ms
PASSED test: t11010 first invalid character 601 ms
PASSED test: t11010 delete invalid character 401 ms
PASSED test: t11010 delete last valid character 401 ms
PASSED test: t11010 delete first valid character 400 ms
PASSED test: t11010 tab from empty 401 ms
PASSED test: t11010 tab back to empty 400 ms
PASSED test: t11010 first valid character after refocus 601 ms
PASSED test: t11010 out of range after refocus 1001 ms
PASSED test: t11010 tab from out of range 401 ms
PASSED test: t11010 tab back to out of range 401 ms
	_AssertFailure: doh._AssertFailure: assertEqual() failed:
	expected
		true
	but got
		false

 with hint: 
		isValid
: assertEqual() failed:
	expected
		true
	but got
		false

 with hint: 
		isValid
doh._AssertFailure: assertEqual() failed:
	expected
		true
	but got
		false

 with hint: 
		isValid
	ERROR IN:
		 function () {
										var d = new doh.Deferred();

										doh.robot.keyPress(dojo.keys.END, 200);
										doh.robot.keyPress(dojo.keys.BACKSPACE, 200);

										doh.robot.sequence(d.getTestCallback(function(){
											doh.is(true, textbox.isValid(false), "isValid");
											doh.is("", textbox.state, "state");
											doh.is(promptMessage, textbox._message, "tooltip");
										}), 200);

										return d;
									}
FAILED test: t11010 delete out of range character 601 ms
PASSED test: t11010 delete remaining characters 600 ms
PASSED test: t11010 tab from empty 2 401 ms
Total time for GROUP " t11010 " is  9.5s
PASSED test: t11010 tab back to empty 2 400 ms
Total time for GROUP " t11010 " is  9.9s
------------------------------------------------------------
GROUP "t11011" has 17 tests to run
PASSED test: t11011 first focus, empty value 1701 ms
PASSED test: t11011 first valid character 601 ms
PASSED test: t11011 second valid character 601 ms
PASSED test: t11011 first invalid character 600 ms
PASSED test: t11011 delete invalid character 401 ms
PASSED test: t11011 delete last valid character 401 ms
PASSED test: t11011 delete first valid character 401 ms
PASSED test: t11011 tab from empty 400 ms
PASSED test: t11011 tab back to empty 401 ms
PASSED test: t11011 first valid character after refocus 601 ms
PASSED test: t11011 out of range after refocus 1001 ms
PASSED test: t11011 tab from out of range 400 ms
PASSED test: t11011 tab back to out of range 400 ms
	_AssertFailure: doh._AssertFailure: assertEqual() failed:
	expected
		true
	but got
		false

 with hint: 
		isValid
: assertEqual() failed:
	expected
		true
	but got
		false

 with hint: 
		isValid
doh._AssertFailure: assertEqual() failed:
	expected
		true
	but got
		false

 with hint: 
		isValid
	ERROR IN:
		 function () {
										var d = new doh.Deferred();

										doh.robot.keyPress(dojo.keys.END, 200);
										doh.robot.keyPress(dojo.keys.BACKSPACE, 200);

										doh.robot.sequence(d.getTestCallback(function(){
											doh.is(true, textbox.isValid(false), "isValid");
											doh.is("", textbox.state, "state");
											doh.is(promptMessage, textbox._message, "tooltip");
										}), 200);

										return d;
									}
FAILED test: t11011 delete out of range character 601 ms
PASSED test: t11011 delete remaining characters 600 ms
PASSED test: t11011 tab from empty 2 400 ms
Total time for GROUP " t11011 " is  9.5s
PASSED test: t11011 tab back to empty 2 401 ms
Total time for GROUP " t11011 " is  9.9s
------------------------------------------------------------
GROUP "t11100" has 17 tests to run
PASSED test: t11100 first focus, empty value 1701 ms
PASSED test: t11100 first valid character 600 ms
PASSED test: t11100 second valid character 602 ms
PASSED test: t11100 first invalid character 600 ms
PASSED test: t11100 delete invalid character 401 ms
PASSED test: t11100 delete last valid character 401 ms
PASSED test: t11100 delete first valid character 401 ms
PASSED test: t11100 tab from empty 400 ms
PASSED test: t11100 tab back to empty 401 ms
PASSED test: t11100 first valid character after refocus 601 ms
PASSED test: t11100 out of range after refocus 1000 ms
PASSED test: t11100 tab from out of range 401 ms
PASSED test: t11100 tab back to out of range 401 ms
	_AssertFailure: doh._AssertFailure: assertEqual() failed:
	expected
		true
	but got
		false

 with hint: 
		isValid
: assertEqual() failed:
	expected
		true
	but got
		false

 with hint: 
		isValid
doh._AssertFailure: assertEqual() failed:
	expected
		true
	but got
		false

 with hint: 
		isValid
	ERROR IN:
		 function () {
										var d = new doh.Deferred();

										doh.robot.keyPress(dojo.keys.END, 200);
										doh.robot.keyPress(dojo.keys.BACKSPACE, 200);

										doh.robot.sequence(d.getTestCallback(function(){
											doh.is(true, textbox.isValid(false), "isValid");
											doh.is("", textbox.state, "state");
											doh.is(promptMessage, textbox._message, "tooltip");
										}), 200);

										return d;
									}
FAILED test: t11100 delete out of range character 601 ms
PASSED test: t11100 delete remaining characters 600 ms
PASSED test: t11100 tab from empty 2 401 ms
Total time for GROUP " t11100 " is  9.5s
PASSED test: t11100 tab back to empty 2 400 ms
Total time for GROUP " t11100 " is  9.9s
------------------------------------------------------------
GROUP "t11101" has 17 tests to run
PASSED test: t11101 first focus, empty value 1701 ms
PASSED test: t11101 first valid character 601 ms
PASSED test: t11101 second valid character 601 ms
PASSED test: t11101 first invalid character 600 ms
PASSED test: t11101 delete invalid character 401 ms
PASSED test: t11101 delete last valid character 401 ms
PASSED test: t11101 delete first valid character 401 ms
PASSED test: t11101 tab from empty 400 ms
PASSED test: t11101 tab back to empty 401 ms
PASSED test: t11101 first valid character after refocus 600 ms
PASSED test: t11101 out of range after refocus 1001 ms
PASSED test: t11101 tab from out of range 401 ms
PASSED test: t11101 tab back to out of range 400 ms
	_AssertFailure: doh._AssertFailure: assertEqual() failed:
	expected
		true
	but got
		false

 with hint: 
		isValid
: assertEqual() failed:
	expected
		true
	but got
		false

 with hint: 
		isValid
doh._AssertFailure: assertEqual() failed:
	expected
		true
	but got
		false

 with hint: 
		isValid
	ERROR IN:
		 function () {
										var d = new doh.Deferred();

										doh.robot.keyPress(dojo.keys.END, 200);
										doh.robot.keyPress(dojo.keys.BACKSPACE, 200);

										doh.robot.sequence(d.getTestCallback(function(){
											doh.is(true, textbox.isValid(false), "isValid");
											doh.is("", textbox.state, "state");
											doh.is(promptMessage, textbox._message, "tooltip");
										}), 200);

										return d;
									}
FAILED test: t11101 delete out of range character 601 ms
PASSED test: t11101 delete remaining characters 601 ms
PASSED test: t11101 tab from empty 2 401 ms
Total time for GROUP " t11101 " is  9.5s
PASSED test: t11101 tab back to empty 2 400 ms
Total time for GROUP " t11101 " is  9.9s
------------------------------------------------------------
GROUP "t11110" has 17 tests to run
PASSED test: t11110 first focus, empty value 1702 ms
PASSED test: t11110 first valid character 600 ms
PASSED test: t11110 second valid character 602 ms
PASSED test: t11110 first invalid character 601 ms
PASSED test: t11110 delete invalid character 401 ms
PASSED test: t11110 delete last valid character 400 ms
PASSED test: t11110 delete first valid character 401 ms
PASSED test: t11110 tab from empty 400 ms
PASSED test: t11110 tab back to empty 401 ms
PASSED test: t11110 first valid character after refocus 601 ms
PASSED test: t11110 out of range after refocus 1000 ms
PASSED test: t11110 tab from out of range 402 ms
PASSED test: t11110 tab back to out of range 400 ms
	_AssertFailure: doh._AssertFailure: assertEqual() failed:
	expected
		true
	but got
		false

 with hint: 
		isValid
: assertEqual() failed:
	expected
		true
	but got
		false

 with hint: 
		isValid
doh._AssertFailure: assertEqual() failed:
	expected
		true
	but got
		false

 with hint: 
		isValid
	ERROR IN:
		 function () {
										var d = new doh.Deferred();

										doh.robot.keyPress(dojo.keys.END, 200);
										doh.robot.keyPress(dojo.keys.BACKSPACE, 200);

										doh.robot.sequence(d.getTestCallback(function(){
											doh.is(true, textbox.isValid(false), "isValid");
											doh.is("", textbox.state, "state");
											doh.is(promptMessage, textbox._message, "tooltip");
										}), 200);

										return d;
									}
FAILED test: t11110 delete out of range character 601 ms
PASSED test: t11110 delete remaining characters 600 ms
PASSED test: t11110 tab from empty 2 401 ms
Total time for GROUP " t11110 " is  9.5s
PASSED test: t11110 tab back to empty 2 401 ms
Total time for GROUP " t11110 " is  9.9s
------------------------------------------------------------
GROUP "t11111" has 17 tests to run
PASSED test: t11111 first focus, empty value 1701 ms
PASSED test: t11111 first valid character 600 ms
PASSED test: t11111 second valid character 601 ms
PASSED test: t11111 first invalid character 601 ms
PASSED test: t11111 delete invalid character 401 ms
PASSED test: t11111 delete last valid character 400 ms
PASSED test: t11111 delete first valid character 400 ms
PASSED test: t11111 tab from empty 401 ms
PASSED test: t11111 tab back to empty 401 ms
PASSED test: t11111 first valid character after refocus 600 ms
PASSED test: t11111 out of range after refocus 1001 ms
PASSED test: t11111 tab from out of range 401 ms
PASSED test: t11111 tab back to out of range 400 ms
	_AssertFailure: doh._AssertFailure: assertEqual() failed:
	expected
		true
	but got
		false

 with hint: 
		isValid
: assertEqual() failed:
	expected
		true
	but got
		false

 with hint: 
		isValid
doh._AssertFailure: assertEqual() failed:
	expected
		true
	but got
		false

 with hint: 
		isValid
	ERROR IN:
		 function () {
										var d = new doh.Deferred();

										doh.robot.keyPress(dojo.keys.END, 200);
										doh.robot.keyPress(dojo.keys.BACKSPACE, 200);

										doh.robot.sequence(d.getTestCallback(function(){
											doh.is(true, textbox.isValid(false), "isValid");
											doh.is("", textbox.state, "state");
											doh.is(promptMessage, textbox._message, "tooltip");
										}), 200);

										return d;
									}
FAILED test: t11111 delete out of range character 601 ms
PASSED test: t11111 delete remaining characters 601 ms
PASSED test: t11111 tab from empty 2 401 ms
Total time for GROUP " t11111 " is  9.5s
PASSED test: t11111 tab back to empty 2 408 ms
Total time for GROUP " t11111 " is  9.9s
doh._failureCount: 16
------------------------------------------------------------
| TEST SUMMARY:
------------------------------------------------------------
	 544 tests in 32 groups
	 0 errors
	 16 failures

Similarly firefox is getting 17 failures on mac, but running correctly on windows:

 ....loading....
 	
URL
	
Status
	
Domain
	
Size
	
Timeline
Firebug's log limit has been reached. 0 entries not shown.		Preferences	 
Net panel activated. Any requests while the net panel is inactive are not shown.
 	
-
			
0KB
	
(0KB from cache)
0ms
Firebug's log limit has been reached. 233 entries not shown.		Preferences	 
PASSED test: t01010 tab back to out of range 401 ms
bootstrap.js (line 808)
_AssertFailure: http://localhost/clean/dojo/_base/_loader/bootstrap.js:581 doh._AssertFailure: assertEqual() failed: expected true but got false with hint: isValid
bootstrap.js (line 808)
doh._AssertFailure
[Break on this error] (no source for )
(line 0)
<System>
ERROR IN: (function () {var d = new (doh.Deferred);doh.robot.keyPress(dojo.keys.END, 200);doh.robot.keyPress(dojo.keys.BACKSPACE, 200);doh.robot.sequence(d.getTestCallback(function () {doh.is(true, textbox.isValid(false), "isValid");doh.is("", textbox.state, "state");doh.is(promptMessage, textbox._message, "tooltip");}), 200);return d;})
bootstrap.js (line 808)
FAILED test: t01010 delete out of range character 1887 ms
bootstrap.js (line 808)
PASSED test: t01010 delete remaining characters 585 ms
bootstrap.js (line 808)
PASSED test: t01010 tab from empty 2 391 ms
bootstrap.js (line 808)
Total time for GROUP " t01010 " is 10.8s
bootstrap.js (line 808)
PASSED test: t01010 tab back to empty 2 407 ms
bootstrap.js (line 808)
Total time for GROUP " t01010 " is 11.2s
bootstrap.js (line 808)
------------------------------------------------------------
bootstrap.js (line 808)
GROUP "t01011" has 17 tests to run
bootstrap.js (line 808)
PASSED test: t01011 first focus, empty value 1696 ms
bootstrap.js (line 808)
PASSED test: t01011 first valid character 601 ms
bootstrap.js (line 808)
PASSED test: t01011 second valid character 601 ms
bootstrap.js (line 808)
PASSED test: t01011 first invalid character 600 ms
bootstrap.js (line 808)
PASSED test: t01011 delete invalid character 401 ms
bootstrap.js (line 808)
PASSED test: t01011 delete last valid character 402 ms
bootstrap.js (line 808)
PASSED test: t01011 delete first valid character 400 ms
bootstrap.js (line 808)
PASSED test: t01011 tab from empty 400 ms
bootstrap.js (line 808)
PASSED test: t01011 tab back to empty 401 ms
bootstrap.js (line 808)
PASSED test: t01011 first valid character after refocus 602 ms
bootstrap.js (line 808)
PASSED test: t01011 out of range after refocus 1002 ms
bootstrap.js (line 808)
PASSED test: t01011 tab from out of range 402 ms
bootstrap.js (line 808)
PASSED test: t01011 tab back to out of range 401 ms
bootstrap.js (line 808)
_AssertFailure: http://localhost/clean/dojo/_base/_loader/bootstrap.js:581 doh._AssertFailure: assertEqual() failed: expected true but got false with hint: isValid
bootstrap.js (line 808)
doh._AssertFailure
[Break on this error] (no source for )
(line 0)
<System>
ERROR IN: (function () {var d = new (doh.Deferred);doh.robot.keyPress(dojo.keys.END, 200);doh.robot.keyPress(dojo.keys.BACKSPACE, 200);doh.robot.sequence(d.getTestCallback(function () {doh.is(true, textbox.isValid(false), "isValid");doh.is("", textbox.state, "state");doh.is(promptMessage, textbox._message, "tooltip");}), 200);return d;})
bootstrap.js (line 808)
FAILED test: t01011 delete out of range character 1885 ms
bootstrap.js (line 808)
PASSED test: t01011 delete remaining characters 586 ms
bootstrap.js (line 808)
PASSED test: t01011 tab from empty 2 391 ms
bootstrap.js (line 808)
Total time for GROUP " t01011 " is 10.8s
bootstrap.js (line 808)
PASSED test: t01011 tab back to empty 2 401 ms
bootstrap.js (line 808)
Total time for GROUP " t01011 " is 11.2s
bootstrap.js (line 808)
------------------------------------------------------------
bootstrap.js (line 808)
GROUP "t01100" has 17 tests to run
bootstrap.js (line 808)
PASSED test: t01100 first focus, empty value 1698 ms
bootstrap.js (line 808)
PASSED test: t01100 first valid character 601 ms
bootstrap.js (line 808)
PASSED test: t01100 second valid character 601 ms
bootstrap.js (line 808)
PASSED test: t01100 first invalid character 603 ms
bootstrap.js (line 808)
PASSED test: t01100 delete invalid character 385 ms
bootstrap.js (line 808)
PASSED test: t01100 delete last valid character 392 ms
bootstrap.js (line 808)
PASSED test: t01100 delete first valid character 394 ms
bootstrap.js (line 808)
PASSED test: t01100 tab from empty 406 ms
bootstrap.js (line 808)
PASSED test: t01100 tab back to empty 398 ms
bootstrap.js (line 808)
PASSED test: t01100 first valid character after refocus 601 ms
bootstrap.js (line 808)
PASSED test: t01100 out of range after refocus 1002 ms
bootstrap.js (line 808)
PASSED test: t01100 tab from out of range 402 ms
bootstrap.js (line 808)
PASSED test: t01100 tab back to out of range 401 ms
bootstrap.js (line 808)
_AssertFailure: http://localhost/clean/dojo/_base/_loader/bootstrap.js:581 doh._AssertFailure: assertEqual() failed: expected true but got false with hint: isValid
bootstrap.js (line 808)
doh._AssertFailure
[Break on this error] (no source for )
(line 0)
<System>
ERROR IN: (function () {var d = new (doh.Deferred);doh.robot.keyPress(dojo.keys.END, 200);doh.robot.keyPress(dojo.keys.BACKSPACE, 200);doh.robot.sequence(d.getTestCallback(function () {doh.is(true, textbox.isValid(false), "isValid");doh.is("", textbox.state, "state");doh.is(promptMessage, textbox._message, "tooltip");}), 200);return d;})
bootstrap.js (line 808)
FAILED test: t01100 delete out of range character 1888 ms
bootstrap.js (line 808)
PASSED test: t01100 delete remaining characters 581 ms
bootstrap.js (line 808)
PASSED test: t01100 tab from empty 2 408 ms
bootstrap.js (line 808)
Total time for GROUP " t01100 " is 10.8s
bootstrap.js (line 808)
PASSED test: t01100 tab back to empty 2 398 ms
bootstrap.js (line 808)
Total time for GROUP " t01100 " is 11.2s
bootstrap.js (line 808)
------------------------------------------------------------
bootstrap.js (line 808)
GROUP "t01101" has 17 tests to run
bootstrap.js (line 808)
PASSED test: t01101 first focus, empty value 1699 ms
bootstrap.js (line 808)
PASSED test: t01101 first valid character 603 ms
bootstrap.js (line 808)
PASSED test: t01101 second valid character 601 ms
bootstrap.js (line 808)
PASSED test: t01101 first invalid character 601 ms
bootstrap.js (line 808)
PASSED test: t01101 delete invalid character 401 ms
bootstrap.js (line 808)
PASSED test: t01101 delete last valid character 401 ms
bootstrap.js (line 808)
PASSED test: t01101 delete first valid character 401 ms
bootstrap.js (line 808)
PASSED test: t01101 tab from empty 399 ms
bootstrap.js (line 808)
PASSED test: t01101 tab back to empty 400 ms
bootstrap.js (line 808)
PASSED test: t01101 first valid character after refocus 601 ms
bootstrap.js (line 808)
PASSED test: t01101 out of range after refocus 1003 ms
bootstrap.js (line 808)
PASSED test: t01101 tab from out of range 402 ms
bootstrap.js (line 808)
PASSED test: t01101 tab back to out of range 402 ms
bootstrap.js (line 808)
_AssertFailure: http://localhost/clean/dojo/_base/_loader/bootstrap.js:581 doh._AssertFailure: assertEqual() failed: expected true but got false with hint: isValid
bootstrap.js (line 808)
doh._AssertFailure
[Break on this error] (no source for )
(line 0)
<System>
ERROR IN: (function () {var d = new (doh.Deferred);doh.robot.keyPress(dojo.keys.END, 200);doh.robot.keyPress(dojo.keys.BACKSPACE, 200);doh.robot.sequence(d.getTestCallback(function () {doh.is(true, textbox.isValid(false), "isValid");doh.is("", textbox.state, "state");doh.is(promptMessage, textbox._message, "tooltip");}), 200);return d;})
bootstrap.js (line 808)
FAILED test: t01101 delete out of range character 1886 ms
bootstrap.js (line 808)
PASSED test: t01101 delete remaining characters 583 ms
bootstrap.js (line 808)
PASSED test: t01101 tab from empty 2 423 ms
bootstrap.js (line 808)
Total time for GROUP " t01101 " is 10.8s
bootstrap.js (line 808)
PASSED test: t01101 tab back to empty 2 397 ms
bootstrap.js (line 808)
Total time for GROUP " t01101 " is 11.2s
bootstrap.js (line 808)
------------------------------------------------------------
bootstrap.js (line 808)
GROUP "t01110" has 17 tests to run
bootstrap.js (line 808)
PASSED test: t01110 first focus, empty value 1700 ms
bootstrap.js (line 808)
PASSED test: t01110 first valid character 601 ms
bootstrap.js (line 808)
PASSED test: t01110 second valid character 599 ms
bootstrap.js (line 808)
PASSED test: t01110 first invalid character 601 ms
bootstrap.js (line 808)
PASSED test: t01110 delete invalid character 391 ms
bootstrap.js (line 808)
PASSED test: t01110 delete last valid character 412 ms
bootstrap.js (line 808)
PASSED test: t01110 delete first valid character 403 ms
bootstrap.js (line 808)
PASSED test: t01110 tab from empty 399 ms
bootstrap.js (line 808)
PASSED test: t01110 tab back to empty 402 ms
bootstrap.js (line 808)
PASSED test: t01110 first valid character after refocus 602 ms
bootstrap.js (line 808)
PASSED test: t01110 out of range after refocus 1001 ms
bootstrap.js (line 808)
PASSED test: t01110 tab from out of range 401 ms
bootstrap.js (line 808)
PASSED test: t01110 tab back to out of range 402 ms
bootstrap.js (line 808)
_AssertFailure: http://localhost/clean/dojo/_base/_loader/bootstrap.js:581 doh._AssertFailure: assertEqual() failed: expected true but got false with hint: isValid
bootstrap.js (line 808)
doh._AssertFailure
[Break on this error] (no source for )
(line 0)
<System>
ERROR IN: (function () {var d = new (doh.Deferred);doh.robot.keyPress(dojo.keys.END, 200);doh.robot.keyPress(dojo.keys.BACKSPACE, 200);doh.robot.sequence(d.getTestCallback(function () {doh.is(true, textbox.isValid(false), "isValid");doh.is("", textbox.state, "state");doh.is(promptMessage, textbox._message, "tooltip");}), 200);return d;})
bootstrap.js (line 808)
FAILED test: t01110 delete out of range character 1886 ms
bootstrap.js (line 808)
PASSED test: t01110 delete remaining characters 583 ms
bootstrap.js (line 808)
PASSED test: t01110 tab from empty 2 420 ms
bootstrap.js (line 808)
Total time for GROUP " t01110 " is 10.8s
bootstrap.js (line 808)
PASSED test: t01110 tab back to empty 2 398 ms
bootstrap.js (line 808)
Total time for GROUP " t01110 " is 11.2s
bootstrap.js (line 808)
------------------------------------------------------------
bootstrap.js (line 808)
GROUP "t01111" has 17 tests to run
bootstrap.js (line 808)
PASSED test: t01111 first focus, empty value 1699 ms
bootstrap.js (line 808)
PASSED test: t01111 first valid character 602 ms
bootstrap.js (line 808)
PASSED test: t01111 second valid character 600 ms
bootstrap.js (line 808)
PASSED test: t01111 first invalid character 601 ms
bootstrap.js (line 808)
PASSED test: t01111 delete invalid character 402 ms
bootstrap.js (line 808)
PASSED test: t01111 delete last valid character 401 ms
bootstrap.js (line 808)
PASSED test: t01111 delete first valid character 400 ms
bootstrap.js (line 808)
PASSED test: t01111 tab from empty 399 ms
bootstrap.js (line 808)
PASSED test: t01111 tab back to empty 400 ms
bootstrap.js (line 808)
PASSED test: t01111 first valid character after refocus 602 ms
bootstrap.js (line 808)
PASSED test: t01111 out of range after refocus 1002 ms
bootstrap.js (line 808)
PASSED test: t01111 tab from out of range 402 ms
bootstrap.js (line 808)
PASSED test: t01111 tab back to out of range 401 ms
bootstrap.js (line 808)
_AssertFailure: http://localhost/clean/dojo/_base/_loader/bootstrap.js:581 doh._AssertFailure: assertEqual() failed: expected true but got false with hint: isValid
bootstrap.js (line 808)
doh._AssertFailure
[Break on this error] (no source for )
(line 0)
<System>
ERROR IN: (function () {var d = new (doh.Deferred);doh.robot.keyPress(dojo.keys.END, 200);doh.robot.keyPress(dojo.keys.BACKSPACE, 200);doh.robot.sequence(d.getTestCallback(function () {doh.is(true, textbox.isValid(false), "isValid");doh.is("", textbox.state, "state");doh.is(promptMessage, textbox._message, "tooltip");}), 200);return d;})
bootstrap.js (line 808)
FAILED test: t01111 delete out of range character 1884 ms
bootstrap.js (line 808)
PASSED test: t01111 delete remaining characters 583 ms
bootstrap.js (line 808)
PASSED test: t01111 tab from empty 2 422 ms
bootstrap.js (line 808)
Total time for GROUP " t01111 " is 10.8s
bootstrap.js (line 808)
PASSED test: t01111 tab back to empty 2 397 ms
bootstrap.js (line 808)
Total time for GROUP " t01111 " is 11.2s
bootstrap.js (line 808)
------------------------------------------------------------
bootstrap.js (line 808)
GROUP "t10000" has 17 tests to run
bootstrap.js (line 808)
PASSED test: t10000 first focus, empty value 1699 ms
bootstrap.js (line 808)
PASSED test: t10000 first valid character 600 ms
bootstrap.js (line 808)
PASSED test: t10000 second valid character 601 ms
bootstrap.js (line 808)
PASSED test: t10000 first invalid character 601 ms
bootstrap.js (line 808)
PASSED test: t10000 delete invalid character 382 ms
bootstrap.js (line 808)
PASSED test: t10000 delete last valid character 389 ms
bootstrap.js (line 808)
PASSED test: t10000 delete first valid character 393 ms
bootstrap.js (line 808)
PASSED test: t10000 tab from empty 400 ms
bootstrap.js (line 808)
PASSED test: t10000 tab back to empty 408 ms
bootstrap.js (line 808)
PASSED test: t10000 first valid character after refocus 600 ms
bootstrap.js (line 808)
PASSED test: t10000 out of range after refocus 1001 ms
bootstrap.js (line 808)
PASSED test: t10000 tab from out of range 401 ms
bootstrap.js (line 808)
PASSED test: t10000 tab back to out of range 401 ms
bootstrap.js (line 808)
PASSED test: t10000 delete out of range character 600 ms
bootstrap.js (line 808)
PASSED test: t10000 delete remaining characters 597 ms
bootstrap.js (line 808)
PASSED test: t10000 tab from empty 2 399 ms
bootstrap.js (line 808)
Total time for GROUP " t10000 " is 9.5s
bootstrap.js (line 808)
PASSED test: t10000 tab back to empty 2 399 ms
bootstrap.js (line 808)
Total time for GROUP " t10000 " is 9.9s
bootstrap.js (line 808)
------------------------------------------------------------
bootstrap.js (line 808)
GROUP "t10001" has 17 tests to run
bootstrap.js (line 808)
PASSED test: t10001 first focus, empty value 1696 ms
bootstrap.js (line 808)
PASSED test: t10001 first valid character 598 ms
bootstrap.js (line 808)
PASSED test: t10001 second valid character 603 ms
bootstrap.js (line 808)
PASSED test: t10001 first invalid character 602 ms
bootstrap.js (line 808)
PASSED test: t10001 delete invalid character 400 ms
bootstrap.js (line 808)
PASSED test: t10001 delete last valid character 401 ms
bootstrap.js (line 808)
PASSED test: t10001 delete first valid character 401 ms
bootstrap.js (line 808)
PASSED test: t10001 tab from empty 401 ms
bootstrap.js (line 808)
PASSED test: t10001 tab back to empty 401 ms
bootstrap.js (line 808)
PASSED test: t10001 first valid character after refocus 601 ms
bootstrap.js (line 808)
PASSED test: t10001 out of range after refocus 1001 ms
bootstrap.js (line 808)
PASSED test: t10001 tab from out of range 401 ms
bootstrap.js (line 808)
PASSED test: t10001 tab back to out of range 403 ms
bootstrap.js (line 808)
PASSED test: t10001 delete out of range character 601 ms
bootstrap.js (line 808)
PASSED test: t10001 delete remaining characters 601 ms
bootstrap.js (line 808)
PASSED test: t10001 tab from empty 2 400 ms
bootstrap.js (line 808)
Total time for GROUP " t10001 " is 9.5s
bootstrap.js (line 808)
PASSED test: t10001 tab back to empty 2 401 ms
bootstrap.js (line 808)
Total time for GROUP " t10001 " is 9.9s
bootstrap.js (line 808)
------------------------------------------------------------
bootstrap.js (line 808)
GROUP "t10010" has 17 tests to run
bootstrap.js (line 808)
PASSED test: t10010 first focus, empty value 1696 ms
bootstrap.js (line 808)
PASSED test: t10010 first valid character 597 ms
bootstrap.js (line 808)
PASSED test: t10010 second valid character 604 ms
bootstrap.js (line 808)
PASSED test: t10010 first invalid character 599 ms
bootstrap.js (line 808)
PASSED test: t10010 delete invalid character 402 ms
bootstrap.js (line 808)
PASSED test: t10010 delete last valid character 394 ms
bootstrap.js (line 808)
PASSED test: t10010 delete first valid character 397 ms
bootstrap.js (line 808)
PASSED test: t10010 tab from empty 398 ms
bootstrap.js (line 808)
PASSED test: t10010 tab back to empty 407 ms
bootstrap.js (line 808)
PASSED test: t10010 first valid character after refocus 601 ms
bootstrap.js (line 808)
PASSED test: t10010 out of range after refocus 1001 ms
bootstrap.js (line 808)
PASSED test: t10010 tab from out of range 401 ms
bootstrap.js (line 808)
PASSED test: t10010 tab back to out of range 402 ms
bootstrap.js (line 808)
PASSED test: t10010 delete out of range character 601 ms
bootstrap.js (line 808)
PASSED test: t10010 delete remaining characters 594 ms
bootstrap.js (line 808)
PASSED test: t10010 tab from empty 2 396 ms
bootstrap.js (line 808)
Total time for GROUP " t10010 " is 9.5s
bootstrap.js (line 808)
PASSED test: t10010 tab back to empty 2 397 ms
bootstrap.js (line 808)
Total time for GROUP " t10010 " is 9.9s
bootstrap.js (line 808)
------------------------------------------------------------
bootstrap.js (line 808)
GROUP "t10011" has 17 tests to run
bootstrap.js (line 808)
PASSED test: t10011 first focus, empty value 1696 ms
bootstrap.js (line 808)
PASSED test: t10011 first valid character 599 ms
bootstrap.js (line 808)
PASSED test: t10011 second valid character 604 ms
bootstrap.js (line 808)
PASSED test: t10011 first invalid character 599 ms
bootstrap.js (line 808)
PASSED test: t10011 delete invalid character 402 ms
bootstrap.js (line 808)
PASSED test: t10011 delete last valid character 401 ms
bootstrap.js (line 808)
PASSED test: t10011 delete first valid character 400 ms
bootstrap.js (line 808)
PASSED test: t10011 tab from empty 402 ms
bootstrap.js (line 808)
PASSED test: t10011 tab back to empty 402 ms
bootstrap.js (line 808)
PASSED test: t10011 first valid character after refocus 601 ms
bootstrap.js (line 808)
PASSED test: t10011 out of range after refocus 1001 ms
bootstrap.js (line 808)
PASSED test: t10011 tab from out of range 401 ms
bootstrap.js (line 808)
PASSED test: t10011 tab back to out of range 401 ms
bootstrap.js (line 808)
PASSED test: t10011 delete out of range character 601 ms
bootstrap.js (line 808)
PASSED test: t10011 delete remaining characters 639 ms
bootstrap.js (line 808)
PASSED test: t10011 tab from empty 2 397 ms
bootstrap.js (line 808)
Total time for GROUP " t10011 " is 9.5s
bootstrap.js (line 808)
PASSED test: t10011 tab back to empty 2 398 ms
bootstrap.js (line 808)
Total time for GROUP " t10011 " is 9.9s
bootstrap.js (line 808)
------------------------------------------------------------
bootstrap.js (line 808)
GROUP "t10100" has 17 tests to run
bootstrap.js (line 808)
PASSED test: t10100 first focus, empty value 1696 ms
bootstrap.js (line 808)
PASSED test: t10100 first valid character 603 ms
bootstrap.js (line 808)
PASSED test: t10100 second valid character 601 ms
bootstrap.js (line 808)
PASSED test: t10100 first invalid character 600 ms
bootstrap.js (line 808)
PASSED test: t10100 delete invalid character 401 ms
bootstrap.js (line 808)
PASSED test: t10100 delete last valid character 462 ms
bootstrap.js (line 808)
PASSED test: t10100 delete first valid character 393 ms
bootstrap.js (line 808)
PASSED test: t10100 tab from empty 398 ms
bootstrap.js (line 808)
PASSED test: t10100 tab back to empty 401 ms
bootstrap.js (line 808)
PASSED test: t10100 first valid character after refocus 599 ms
bootstrap.js (line 808)
PASSED test: t10100 out of range after refocus 1001 ms
bootstrap.js (line 808)
PASSED test: t10100 tab from out of range 401 ms
bootstrap.js (line 808)
PASSED test: t10100 tab back to out of range 401 ms
bootstrap.js (line 808)
PASSED test: t10100 delete out of range character 601 ms
bootstrap.js (line 808)
PASSED test: t10100 delete remaining characters 677 ms
bootstrap.js (line 808)
PASSED test: t10100 tab from empty 2 398 ms
bootstrap.js (line 808)
Total time for GROUP " t10100 " is 9.6s
bootstrap.js (line 808)
PASSED test: t10100 tab back to empty 2 401 ms
bootstrap.js (line 808)
Total time for GROUP " t10100 " is 10s
bootstrap.js (line 808)
------------------------------------------------------------
bootstrap.js (line 808)
GROUP "t10101" has 17 tests to run
bootstrap.js (line 808)
PASSED test: t10101 first focus, empty value 1698 ms
bootstrap.js (line 808)
PASSED test: t10101 first valid character 603 ms
bootstrap.js (line 808)
PASSED test: t10101 second valid character 601 ms
bootstrap.js (line 808)
PASSED test: t10101 first invalid character 601 ms
bootstrap.js (line 808)
PASSED test: t10101 delete invalid character 402 ms
bootstrap.js (line 808)
PASSED test: t10101 delete last valid character 401 ms
bootstrap.js (line 808)
PASSED test: t10101 delete first valid character 401 ms
bootstrap.js (line 808)
PASSED test: t10101 tab from empty 401 ms
bootstrap.js (line 808)
PASSED test: t10101 tab back to empty 401 ms
bootstrap.js (line 808)
PASSED test: t10101 first valid character after refocus 601 ms
bootstrap.js (line 808)
PASSED test: t10101 out of range after refocus 1001 ms
bootstrap.js (line 808)
PASSED test: t10101 tab from out of range 402 ms
bootstrap.js (line 808)
PASSED test: t10101 tab back to out of range 401 ms
bootstrap.js (line 808)
PASSED test: t10101 delete out of range character 601 ms
bootstrap.js (line 808)
PASSED test: t10101 delete remaining characters 599 ms
bootstrap.js (line 808)
PASSED test: t10101 tab from empty 2 397 ms
bootstrap.js (line 808)
Total time for GROUP " t10101 " is 9.5s
bootstrap.js (line 808)
PASSED test: t10101 tab back to empty 2 403 ms
bootstrap.js (line 808)
Total time for GROUP " t10101 " is 9.9s
bootstrap.js (line 808)
------------------------------------------------------------
bootstrap.js (line 808)
GROUP "t10110" has 17 tests to run
bootstrap.js (line 808)
PASSED test: t10110 first focus, empty value 1699 ms
bootstrap.js (line 808)
PASSED test: t10110 first valid character 603 ms
bootstrap.js (line 808)
PASSED test: t10110 second valid character 601 ms
bootstrap.js (line 808)
PASSED test: t10110 first invalid character 601 ms
bootstrap.js (line 808)
PASSED test: t10110 delete invalid character 402 ms
bootstrap.js (line 808)
PASSED test: t10110 delete last valid character 556 ms
bootstrap.js (line 808)
PASSED test: t10110 delete first valid character 390 ms
bootstrap.js (line 808)
PASSED test: t10110 tab from empty 398 ms
bootstrap.js (line 808)
PASSED test: t10110 tab back to empty 401 ms
bootstrap.js (line 808)
PASSED test: t10110 first valid character after refocus 599 ms
bootstrap.js (line 808)
PASSED test: t10110 out of range after refocus 1001 ms
bootstrap.js (line 808)
PASSED test: t10110 tab from out of range 401 ms
bootstrap.js (line 808)
PASSED test: t10110 tab back to out of range 401 ms
bootstrap.js (line 808)
PASSED test: t10110 delete out of range character 601 ms
bootstrap.js (line 808)
PASSED test: t10110 delete remaining characters 686 ms
bootstrap.js (line 808)
PASSED test: t10110 tab from empty 2 397 ms
bootstrap.js (line 808)
Total time for GROUP " t10110 " is 9.7s
bootstrap.js (line 808)
PASSED test: t10110 tab back to empty 2 402 ms
bootstrap.js (line 808)
Total time for GROUP " t10110 " is 10.1s
bootstrap.js (line 808)
------------------------------------------------------------
bootstrap.js (line 808)
GROUP "t10111" has 17 tests to run
bootstrap.js (line 808)
PASSED test: t10111 first focus, empty value 1698 ms
bootstrap.js (line 808)
PASSED test: t10111 first valid character 602 ms
bootstrap.js (line 808)
PASSED test: t10111 second valid character 601 ms
bootstrap.js (line 808)
PASSED test: t10111 first invalid character 600 ms
bootstrap.js (line 808)
PASSED test: t10111 delete invalid character 402 ms
bootstrap.js (line 808)
PASSED test: t10111 delete last valid character 400 ms
bootstrap.js (line 808)
PASSED test: t10111 delete first valid character 401 ms
bootstrap.js (line 808)
PASSED test: t10111 tab from empty 401 ms
bootstrap.js (line 808)
PASSED test: t10111 tab back to empty 401 ms
bootstrap.js (line 808)
PASSED test: t10111 first valid character after refocus 600 ms
bootstrap.js (line 808)
PASSED test: t10111 out of range after refocus 1001 ms
bootstrap.js (line 808)
PASSED test: t10111 tab from out of range 402 ms
bootstrap.js (line 808)
PASSED test: t10111 tab back to out of range 401 ms
bootstrap.js (line 808)
PASSED test: t10111 delete out of range character 601 ms
bootstrap.js (line 808)
PASSED test: t10111 delete remaining characters 600 ms
bootstrap.js (line 808)
PASSED test: t10111 tab from empty 2 397 ms
bootstrap.js (line 808)
Total time for GROUP " t10111 " is 9.5s
bootstrap.js (line 808)
PASSED test: t10111 tab back to empty 2 403 ms
bootstrap.js (line 808)
Total time for GROUP " t10111 " is 9.9s
bootstrap.js (line 808)
------------------------------------------------------------
bootstrap.js (line 808)
GROUP "t11000" has 17 tests to run
bootstrap.js (line 808)
PASSED test: t11000 first focus, empty value 1698 ms
bootstrap.js (line 808)
PASSED test: t11000 first valid character 603 ms
bootstrap.js (line 808)
PASSED test: t11000 second valid character 601 ms
bootstrap.js (line 808)
PASSED test: t11000 first invalid character 600 ms
bootstrap.js (line 808)
PASSED test: t11000 delete invalid character 401 ms
bootstrap.js (line 808)
PASSED test: t11000 delete last valid character 401 ms
bootstrap.js (line 808)
PASSED test: t11000 delete first valid character 394 ms
bootstrap.js (line 808)
PASSED test: t11000 tab from empty 396 ms
bootstrap.js (line 808)
PASSED test: t11000 tab back to empty 399 ms
bootstrap.js (line 808)
PASSED test: t11000 first valid character after refocus 603 ms
bootstrap.js (line 808)
PASSED test: t11000 out of range after refocus 1001 ms
bootstrap.js (line 808)
PASSED test: t11000 tab from out of range 401 ms
bootstrap.js (line 808)
PASSED test: t11000 tab back to out of range 401 ms
bootstrap.js (line 808)
_AssertFailure: http://localhost/clean/dojo/_base/_loader/bootstrap.js:581 doh._AssertFailure: assertEqual() failed: expected true but got false with hint: isValid
bootstrap.js (line 808)
doh._AssertFailure
[Break on this error] (no source for )
(line 0)
<System>
ERROR IN: (function () {var d = new (doh.Deferred);doh.robot.keyPress(dojo.keys.END, 200);doh.robot.keyPress(dojo.keys.BACKSPACE, 200);doh.robot.sequence(d.getTestCallback(function () {doh.is(true, textbox.isValid(false), "isValid");doh.is("", textbox.state, "state");doh.is(promptMessage, textbox._message, "tooltip");}), 200);return d;})
bootstrap.js (line 808)
FAILED test: t11000 delete out of range character 1898 ms
bootstrap.js (line 808)
PASSED test: t11000 delete remaining characters 581 ms
bootstrap.js (line 808)
PASSED test: t11000 tab from empty 2 394 ms
bootstrap.js (line 808)
Total time for GROUP " t11000 " is 10.8s
bootstrap.js (line 808)
PASSED test: t11000 tab back to empty 2 420 ms
bootstrap.js (line 808)
Total time for GROUP " t11000 " is 11.2s
bootstrap.js (line 808)
------------------------------------------------------------
bootstrap.js (line 808)
GROUP "t11001" has 17 tests to run
bootstrap.js (line 808)
PASSED test: t11001 first focus, empty value 1698 ms
bootstrap.js (line 808)
PASSED test: t11001 first valid character 598 ms
bootstrap.js (line 808)
PASSED test: t11001 second valid character 603 ms
bootstrap.js (line 808)
PASSED test: t11001 first invalid character 601 ms
bootstrap.js (line 808)
PASSED test: t11001 delete invalid character 400 ms
bootstrap.js (line 808)
PASSED test: t11001 delete last valid character 400 ms
bootstrap.js (line 808)
PASSED test: t11001 delete first valid character 401 ms
bootstrap.js (line 808)
PASSED test: t11001 tab from empty 399 ms
bootstrap.js (line 808)
PASSED test: t11001 tab back to empty 400 ms
bootstrap.js (line 808)
PASSED test: t11001 first valid character after refocus 600 ms
bootstrap.js (line 808)
PASSED test: t11001 out of range after refocus 1001 ms
bootstrap.js (line 808)
PASSED test: t11001 tab from out of range 401 ms
bootstrap.js (line 808)
PASSED test: t11001 tab back to out of range 402 ms
bootstrap.js (line 808)
_AssertFailure: http://localhost/clean/dojo/_base/_loader/bootstrap.js:581 doh._AssertFailure: assertEqual() failed: expected true but got false with hint: isValid
bootstrap.js (line 808)
doh._AssertFailure
[Break on this error] (no source for )
(line 0)
<System>
ERROR IN: (function () {var d = new (doh.Deferred);doh.robot.keyPress(dojo.keys.END, 200);doh.robot.keyPress(dojo.keys.BACKSPACE, 200);doh.robot.sequence(d.getTestCallback(function () {doh.is(true, textbox.isValid(false), "isValid");doh.is("", textbox.state, "state");doh.is(promptMessage, textbox._message, "tooltip");}), 200);return d;})
bootstrap.js (line 808)
FAILED test: t11001 delete out of range character 1898 ms
bootstrap.js (line 808)
PASSED test: t11001 delete remaining characters 581 ms
bootstrap.js (line 808)
PASSED test: t11001 tab from empty 2 393 ms
bootstrap.js (line 808)
Total time for GROUP " t11001 " is 10.8s
bootstrap.js (line 808)
PASSED test: t11001 tab back to empty 2 405 ms
bootstrap.js (line 808)
Total time for GROUP " t11001 " is 11.2s
bootstrap.js (line 808)
------------------------------------------------------------
bootstrap.js (line 808)
GROUP "t11010" has 17 tests to run
bootstrap.js (line 808)
PASSED test: t11010 first focus, empty value 1699 ms
bootstrap.js (line 808)
PASSED test: t11010 first valid character 602 ms
bootstrap.js (line 808)
PASSED test: t11010 second valid character 602 ms
bootstrap.js (line 808)
PASSED test: t11010 first invalid character 601 ms
bootstrap.js (line 808)
_AssertFailure: http://localhost/clean/dojo/_base/_loader/bootstrap.js:581 doh._AssertFailure: assertEqual() failed: expected true but got false with hint: isValid
bootstrap.js (line 808)
doh._AssertFailure
[Break on this error] (no source for )
(line 0)
<System>
ERROR IN: (function () {var d = new (doh.Deferred);doh.robot.keyPress(dojo.keys.BACKSPACE, 200);doh.robot.sequence(d.getTestCallback(function () {doh.is(true, textbox.isValid(false), "isValid");doh.is("", textbox.state, "state");doh.is(promptMessage, textbox._message, "tooltip");}), 200);return d;})
bootstrap.js (line 808)
FAILED test: t11010 delete invalid character 1690 ms
bootstrap.js (line 808)
PASSED test: t11010 delete last valid character 386 ms
bootstrap.js (line 808)
PASSED test: t11010 delete first valid character 409 ms
bootstrap.js (line 808)
PASSED test: t11010 tab from empty 409 ms
bootstrap.js (line 808)
PASSED test: t11010 tab back to empty 396 ms
bootstrap.js (line 808)
PASSED test: t11010 first valid character after refocus 602 ms
bootstrap.js (line 808)
PASSED test: t11010 out of range after refocus 1001 ms
bootstrap.js (line 808)
PASSED test: t11010 tab from out of range 391 ms
bootstrap.js (line 808)
PASSED test: t11010 tab back to out of range 396 ms
bootstrap.js (line 808)
_AssertFailure: http://localhost/clean/dojo/_base/_loader/bootstrap.js:581 doh._AssertFailure: assertEqual() failed: expected true but got false with hint: isValid
bootstrap.js (line 808)
doh._AssertFailure
[Break on this error] (no source for )
(line 0)
<System>
ERROR IN: (function () {var d = new (doh.Deferred);doh.robot.keyPress(dojo.keys.END, 200);doh.robot.keyPress(dojo.keys.BACKSPACE, 200);doh.robot.sequence(d.getTestCallback(function () {doh.is(true, textbox.isValid(false), "isValid");doh.is("", textbox.state, "state");doh.is(promptMessage, textbox._message, "tooltip");}), 200);return d;})
bootstrap.js (line 808)
FAILED test: t11010 delete out of range character 1899 ms
bootstrap.js (line 808)
PASSED test: t11010 delete remaining characters 591 ms
bootstrap.js (line 808)
PASSED test: t11010 tab from empty 2 394 ms
bootstrap.js (line 808)
Total time for GROUP " t11010 " is 12.1s
bootstrap.js (line 808)
PASSED test: t11010 tab back to empty 2 404 ms
bootstrap.js (line 808)
Total time for GROUP " t11010 " is 12.5s
bootstrap.js (line 808)
------------------------------------------------------------
bootstrap.js (line 808)
GROUP "t11011" has 17 tests to run
bootstrap.js (line 808)
PASSED test: t11011 first focus, empty value 1698 ms
bootstrap.js (line 808)
PASSED test: t11011 first valid character 602 ms
bootstrap.js (line 808)
PASSED test: t11011 second valid character 602 ms
bootstrap.js (line 808)
PASSED test: t11011 first invalid character 601 ms
bootstrap.js (line 808)
PASSED test: t11011 delete invalid character 402 ms
bootstrap.js (line 808)
PASSED test: t11011 delete last valid character 401 ms
bootstrap.js (line 808)
PASSED test: t11011 delete first valid character 401 ms
bootstrap.js (line 808)
PASSED test: t11011 tab from empty 401 ms
bootstrap.js (line 808)
PASSED test: t11011 tab back to empty 400 ms
bootstrap.js (line 808)
PASSED test: t11011 first valid character after refocus 601 ms
bootstrap.js (line 808)
PASSED test: t11011 out of range after refocus 1006 ms
bootstrap.js (line 808)
PASSED test: t11011 tab from out of range 401 ms
bootstrap.js (line 808)
PASSED test: t11011 tab back to out of range 401 ms
bootstrap.js (line 808)
_AssertFailure: http://localhost/clean/dojo/_base/_loader/bootstrap.js:581 doh._AssertFailure: assertEqual() failed: expected true but got false with hint: isValid
bootstrap.js (line 808)
doh._AssertFailure
[Break on this error] (no source for )
(line 0)
<System>
ERROR IN: (function () {var d = new (doh.Deferred);doh.robot.keyPress(dojo.keys.END, 200);doh.robot.keyPress(dojo.keys.BACKSPACE, 200);doh.robot.sequence(d.getTestCallback(function () {doh.is(true, textbox.isValid(false), "isValid");doh.is("", textbox.state, "state");doh.is(promptMessage, textbox._message, "tooltip");}), 200);return d;})
bootstrap.js (line 808)
FAILED test: t11011 delete out of range character 1954 ms
bootstrap.js (line 808)
PASSED test: t11011 delete remaining characters 591 ms
bootstrap.js (line 808)
PASSED test: t11011 tab from empty 2 394 ms
bootstrap.js (line 808)
Total time for GROUP " t11011 " is 10.9s
bootstrap.js (line 808)
PASSED test: t11011 tab back to empty 2 403 ms
bootstrap.js (line 808)
Total time for GROUP " t11011 " is 11.3s
bootstrap.js (line 808)
------------------------------------------------------------
bootstrap.js (line 808)
GROUP "t11100" has 17 tests to run
bootstrap.js (line 808)
PASSED test: t11100 first focus, empty value 1701 ms
bootstrap.js (line 808)
PASSED test: t11100 first valid character 599 ms
bootstrap.js (line 808)
PASSED test: t11100 second valid character 599 ms
bootstrap.js (line 808)
PASSED test: t11100 first invalid character 602 ms
bootstrap.js (line 808)
PASSED test: t11100 delete invalid character 403 ms
bootstrap.js (line 808)
PASSED test: t11100 delete last valid character 401 ms
bootstrap.js (line 808)
PASSED test: t11100 delete first valid character 400 ms
bootstrap.js (line 808)
PASSED test: t11100 tab from empty 395 ms
bootstrap.js (line 808)
PASSED test: t11100 tab back to empty 398 ms
bootstrap.js (line 808)
PASSED test: t11100 first valid character after refocus 603 ms
bootstrap.js (line 808)
PASSED test: t11100 out of range after refocus 1000 ms
bootstrap.js (line 808)
PASSED test: t11100 tab from out of range 401 ms
bootstrap.js (line 808)
PASSED test: t11100 tab back to out of range 402 ms
bootstrap.js (line 808)
_AssertFailure: http://localhost/clean/dojo/_base/_loader/bootstrap.js:581 doh._AssertFailure: assertEqual() failed: expected true but got false with hint: isValid
bootstrap.js (line 808)
doh._AssertFailure
[Break on this error] (no source for )
(line 0)
<System>
ERROR IN: (function () {var d = new (doh.Deferred);doh.robot.keyPress(dojo.keys.END, 200);doh.robot.keyPress(dojo.keys.BACKSPACE, 200);doh.robot.sequence(d.getTestCallback(function () {doh.is(true, textbox.isValid(false), "isValid");doh.is("", textbox.state, "state");doh.is(promptMessage, textbox._message, "tooltip");}), 200);return d;})
bootstrap.js (line 808)
FAILED test: t11100 delete out of range character 1904 ms
bootstrap.js (line 808)
PASSED test: t11100 delete remaining characters 594 ms
bootstrap.js (line 808)
PASSED test: t11100 tab from empty 2 403 ms
bootstrap.js (line 808)
Total time for GROUP " t11100 " is 10.8s
bootstrap.js (line 808)
PASSED test: t11100 tab back to empty 2 397 ms
bootstrap.js (line 808)
Total time for GROUP " t11100 " is 11.2s
bootstrap.js (line 808)
------------------------------------------------------------
bootstrap.js (line 808)
GROUP "t11101" has 17 tests to run
bootstrap.js (line 808)
PASSED test: t11101 first focus, empty value 1698 ms
bootstrap.js (line 808)
PASSED test: t11101 first valid character 602 ms
bootstrap.js (line 808)
PASSED test: t11101 second valid character 600 ms
bootstrap.js (line 808)
PASSED test: t11101 first invalid character 601 ms
bootstrap.js (line 808)
PASSED test: t11101 delete invalid character 399 ms
bootstrap.js (line 808)
PASSED test: t11101 delete last valid character 400 ms
bootstrap.js (line 808)
PASSED test: t11101 delete first valid character 400 ms
bootstrap.js (line 808)
PASSED test: t11101 tab from empty 401 ms
bootstrap.js (line 808)
PASSED test: t11101 tab back to empty 400 ms
bootstrap.js (line 808)
PASSED test: t11101 first valid character after refocus 600 ms
bootstrap.js (line 808)
PASSED test: t11101 out of range after refocus 1001 ms
bootstrap.js (line 808)
PASSED test: t11101 tab from out of range 401 ms
bootstrap.js (line 808)
PASSED test: t11101 tab back to out of range 401 ms
bootstrap.js (line 808)
_AssertFailure: http://localhost/clean/dojo/_base/_loader/bootstrap.js:581 doh._AssertFailure: assertEqual() failed: expected true but got false with hint: isValid
bootstrap.js (line 808)
doh._AssertFailure
[Break on this error] (no source for )
(line 0)
<System>
ERROR IN: (function () {var d = new (doh.Deferred);doh.robot.keyPress(dojo.keys.END, 200);doh.robot.keyPress(dojo.keys.BACKSPACE, 200);doh.robot.sequence(d.getTestCallback(function () {doh.is(true, textbox.isValid(false), "isValid");doh.is("", textbox.state, "state");doh.is(promptMessage, textbox._message, "tooltip");}), 200);return d;})
bootstrap.js (line 808)
FAILED test: t11101 delete out of range character 1902 ms
bootstrap.js (line 808)
PASSED test: t11101 delete remaining characters 576 ms
bootstrap.js (line 808)
PASSED test: t11101 tab from empty 2 415 ms
bootstrap.js (line 808)
Total time for GROUP " t11101 " is 10.8s
bootstrap.js (line 808)
PASSED test: t11101 tab back to empty 2 399 ms
bootstrap.js (line 808)
Total time for GROUP " t11101 " is 11.2s
bootstrap.js (line 808)
------------------------------------------------------------
bootstrap.js (line 808)
GROUP "t11110" has 17 tests to run
bootstrap.js (line 808)
PASSED test: t11110 first focus, empty value 1697 ms
bootstrap.js (line 808)
PASSED test: t11110 first valid character 602 ms
bootstrap.js (line 808)
PASSED test: t11110 second valid character 594 ms
bootstrap.js (line 808)
PASSED test: t11110 first invalid character 604 ms
bootstrap.js (line 808)
PASSED test: t11110 delete invalid character 399 ms
bootstrap.js (line 808)
PASSED test: t11110 delete last valid character 401 ms
bootstrap.js (line 808)
PASSED test: t11110 delete first valid character 401 ms
bootstrap.js (line 808)
PASSED test: t11110 tab from empty 401 ms
bootstrap.js (line 808)
PASSED test: t11110 tab back to empty 401 ms
bootstrap.js (line 808)
PASSED test: t11110 first valid character after refocus 601 ms
bootstrap.js (line 808)
PASSED test: t11110 out of range after refocus 1002 ms
bootstrap.js (line 808)
PASSED test: t11110 tab from out of range 403 ms
bootstrap.js (line 808)
PASSED test: t11110 tab back to out of range 401 ms
bootstrap.js (line 808)
_AssertFailure: http://localhost/clean/dojo/_base/_loader/bootstrap.js:581 doh._AssertFailure: assertEqual() failed: expected true but got false with hint: isValid
bootstrap.js (line 808)
doh._AssertFailure
[Break on this error] (no source for )
(line 0)
<System>
ERROR IN: (function () {var d = new (doh.Deferred);doh.robot.keyPress(dojo.keys.END, 200);doh.robot.keyPress(dojo.keys.BACKSPACE, 200);doh.robot.sequence(d.getTestCallback(function () {doh.is(true, textbox.isValid(false), "isValid");doh.is("", textbox.state, "state");doh.is(promptMessage, textbox._message, "tooltip");}), 200);return d;})
bootstrap.js (line 808)
FAILED test: t11110 delete out of range character 1901 ms
bootstrap.js (line 808)
PASSED test: t11110 delete remaining characters 592 ms
bootstrap.js (line 808)
PASSED test: t11110 tab from empty 2 406 ms
bootstrap.js (line 808)
Total time for GROUP " t11110 " is 10.8s
bootstrap.js (line 808)
PASSED test: t11110 tab back to empty 2 396 ms
bootstrap.js (line 808)
Total time for GROUP " t11110 " is 11.2s
bootstrap.js (line 808)
------------------------------------------------------------
bootstrap.js (line 808)
GROUP "t11111" has 17 tests to run
bootstrap.js (line 808)
PASSED test: t11111 first focus, empty value 1686 ms
bootstrap.js (line 808)
PASSED test: t11111 first valid character 609 ms
bootstrap.js (line 808)
PASSED test: t11111 second valid character 600 ms
bootstrap.js (line 808)
PASSED test: t11111 first invalid character 601 ms
bootstrap.js (line 808)
PASSED test: t11111 delete invalid character 400 ms
bootstrap.js (line 808)
PASSED test: t11111 delete last valid character 401 ms
bootstrap.js (line 808)
PASSED test: t11111 delete first valid character 400 ms
bootstrap.js (line 808)
PASSED test: t11111 tab from empty 402 ms
bootstrap.js (line 808)
PASSED test: t11111 tab back to empty 401 ms
bootstrap.js (line 808)
PASSED test: t11111 first valid character after refocus 602 ms
bootstrap.js (line 808)
PASSED test: t11111 out of range after refocus 1000 ms
bootstrap.js (line 808)
PASSED test: t11111 tab from out of range 401 ms
bootstrap.js (line 808)
PASSED test: t11111 tab back to out of range 401 ms
bootstrap.js (line 808)
_AssertFailure: http://localhost/clean/dojo/_base/_loader/bootstrap.js:581 doh._AssertFailure: assertEqual() failed: expected true but got false with hint: isValid
bootstrap.js (line 808)
doh._AssertFailure
[Break on this error] (no source for )
(line 0)
<System>
ERROR IN: (function () {var d = new (doh.Deferred);doh.robot.keyPress(dojo.keys.END, 200);doh.robot.keyPress(dojo.keys.BACKSPACE, 200);doh.robot.sequence(d.getTestCallback(function () {doh.is(true, textbox.isValid(false), "isValid");doh.is("", textbox.state, "state");doh.is(promptMessage, textbox._message, "tooltip");}), 200);return d;})
bootstrap.js (line 808)
FAILED test: t11111 delete out of range character 1899 ms
bootstrap.js (line 808)
PASSED test: t11111 delete remaining characters 575 ms
bootstrap.js (line 808)
PASSED test: t11111 tab from empty 2 417 ms
bootstrap.js (line 808)
Total time for GROUP " t11111 " is 10.8s
bootstrap.js (line 808)
PASSED test: t11111 tab back to empty 2 400 ms
bootstrap.js (line 808)
Total time for GROUP " t11111 " is 11.2s
bootstrap.js (line 808)
doh._failureCount: 17
bootstrap.js (line 1186)
------------------------------------------------------------
bootstrap.js (line 808)
| TEST SUMMARY:
bootstrap.js (line 808)
------------------------------------------------------------
bootstrap.js (line 808)
544 tests in 32 groups
bootstrap.js (line 808)
0 errors
bootstrap.js (line 808)
17 failures
bootstrap.js (line 808)

Change History (2)

comment:1 Changed 9 years ago by Douglas Hays

Milestone: tbd1.5
Status: newassigned

robot problem with pressing END on mac

comment:2 Changed 9 years ago by Douglas Hays

Resolution: fixed
Status: assignedclosed

(In [22241]) Fixes #11211. Add mac-specific key combination for END function.

Note: See TracTickets for help on using tickets.