Custom Query (18300 matches)

Filters
 
Or
 
  
 
Columns

Show under each result:


Results (133 - 135 of 18300)

Ticket Resolution Summary Owner Reporter
#3111 fixed 0.9: All JsonRPC tests fail in Firefox 2.0.0.3 Dustin Machi Jared Jurkiewicz
Description

All JsonRPC tests fail in Firefox 2.0.0.3

GROUP "tests.rpc" has 4 tests to run

TypeError?: ioArgs.cancel is not a function

ERROR IN:

(function () {var d = new doh.Deferred;var td = this.svc.myecho("RPC TEST");td.addCallbacks(function (result) {if (result == "

RPC TEST ") {return true;} else {return new Error("JsonRpc?-EchoTest? test failed, resultant content didn't match");}}, function (result) {return new Error(result);});td.addBoth(d, "callback");return d;})

FAILED test: JsonRPC-EchoTest? Error: Error

ERROR IN:

(function () {var d = new doh.Deferred;var td = this.svc.contentB();td.addCallbacks(function (result) {if (result == "

Content B ") {return true;} else {return new Error("JsonRpc?-EmpytParamTest? test failed, resultant content didn't match");}}, function (result) {return new Error(result);});td.addBoth(d, "callback");return d;})

FAILED test: JsonRPC-EmptyParamTest? Error: Error

ERROR IN:

(function () {var d = new doh.Deferred;var td = this.svc.contentB();td.addCallbacks(function (result) {if (result == "

Content B ") {return true;} else {return new Error("JsonRpc_SMD_Loading_Test failed, resultant content didn't match");}}, function (result) {return new Error(result);});td.addBoth(d, "callback");return d;})

FAILED test: JsonRPC_SMD_Loading_test Error: Deferred(unfired)

ERROR IN:

(function () {var d = new doh.Deferred;var td = this.svc.webSearch({[Error: Query filter requires field and constraints separated by a "="]});td.addCallbacks(function (result) {console.debug(result);return true;if (result == "

Content B ") {return true;} else {return new Error("JsonRpc_SMD_Loading_Test failed, resultant content didn't match");}}, function (result) {return new Error(result);});td.addBoth(d, "callback");return d;})

FAILED test: JsonP_test

#3761 fixed 0.9: All tests._base.array now fail on Safari B3 (Windows) Ben Lowery Jared Jurkiewicz
Description

0.9: All tests._base.array now fail on Safari B3 (Windows)

GROUP "tests._base.array" has 13 tests to run

_AssertFailure: doh._AssertFailure: assertTrue('false') failed: assertTrue('false') failed

doh._AssertFailure: assertTrue('false') failed

ERROR IN:

function testIndexOf(t)

{

var foo = [128,256,512]; var bar = ["aaa","bbb","ccc"]; t.assertTrue(dojo.indexOf([45,56,85], 56) == 1); t.assertTrue(dojo.indexOf([Number,String,Date], String) == 1); t.assertTrue(dojo.indexOf(foo, foo[1]) == 1); t.assertTrue(dojo.indexOf(foo, foo[2]) == 2); t.assertTrue(dojo.indexOf(bar, bar[1]) == 1); t.assertTrue(dojo.indexOf(bar, bar[2]) == 2); foo.push(bar); t.assertTrue(dojo.indexOf(foo, bar) == 3);

}

FAILED test: testIndexOf

_AssertFailure: doh._AssertFailure: assertEqual() failed: expected1| but got |undefined|: assertEqual() failed: expected1| but got |undefined|
doh._AssertFailure: assertEqual() failed: expected1| but got |undefined|

ERROR IN:

function testIndexOfFromIndex(t)

{

var foo = [128,256,512]; var bar = ["aaa","bbb","ccc"]; t.assertEqual(-1, dojo.indexOf([45,56,85], 56, 2)); t.assertEqual(1, dojo.indexOf([45,56,85], 56, 1));

}

FAILED test: testIndexOfFromIndex

_AssertFailure: doh._AssertFailure: assertTrue('false') failed: assertTrue('false') failed

doh._AssertFailure: assertTrue('false') failed

ERROR IN:

function testLastIndexOf(t)

{

var foo = [128,256,512];

This in turn breaks NodeList?, etc.

#3719 duplicate 0.9: Base array tests fail on IE 6 anonymous Jared Jurkiewicz
Description

PASSED test: testIndexOfFromIndex [object Error] ERROR IN: function testLastIndexOf(t){ var foo = [128, 256, 512]; var bar = ["aaa", "bbb", "aaa", "ccc"]; t.assertTrue(dojo.indexOf([45, 56, 85], 56) == 1); t.assertTrue(dojo.indexOf([Number, String, Date], String) == 1); t.assertTrue(dojo.lastIndexOf(foo, foo[1]) == 1); t.assertTrue(dojo.lastIndexOf(foo, foo[2]) == 2); t.assertTrue(dojo.lastIndexOf(bar, bar[1]) == 1); t.assertTrue(dojo.lastIndexOf(bar, bar[2]) == 2); t.assertTrue(dojo.lastIndexOf(bar, bar[0]) == 2); } FAILED test: testLastIndexOf [object Error] ERROR IN: function testLastIndexOfFromIndex(t){ FIXME: what happens w/ negative indexes? t.assertEqual(1, dojo.lastIndexOf([45, 56, 85], 56, 1)); t.assertEqual(-1, dojo.lastIndexOf([45, 56, 85], 85, 1)); } FAILED test: testLastIndexOfFromIndex PASSED test: testForEach

Note: See TracQuery for help on using queries.